{"text_format":"3","workbook":"xlsx","n_sheets":20,"sheets":["エラー表示","添付資料","表紙","基本情報入力","英文名称入力","試験区分入力","試験規格入力","認定試験実施設備入力","AccessImport_0","AccessImport_1","AccessImport_2","AccessImport","試験項目マスタ","試験区分マスタ","試験規格マスタ","設定_試験項目","設定_試験区分","設定_試験規格","事務局用メニュー","【テンプレート】新規格入力"],"not_rendered":{"images":9,"macros":1,"external_links":1,"defined_names":107,"comments":3},"read":"whole","date_system":"1900"}

{"sheet":"エラー表示","index":0,"n_rows":1,"n_cols":1,"rows_kept":1}
["エラー表示"]

{"sheet":"添付資料","index":1,"n_rows":61,"n_cols":4,"rows_kept":61}
["添付資料"]
[null,"・","下記書類の他に試験区分に関する資料も必要です。試験区分シートを参照してください。"]
[null,"・","認定申請書、添付資料および付属文書は正・副（正本１通、副本２通、計３通、またはVLAC指示による通数）をCDやDVDに記録して提出して下さい。"]
[null,"・","電子ファイルのファイル名には下線の名を付して記録して下さい。"]
[]
[null,"新規認定・認定更新・認定拡大・認定変更"]
[null,"・","認定拡大･変更審査の場合、②の資料は不要です。"]
[null,"・","③～⑮は拡大・変更に関連する資料を提出して下さい。"]
[null,"・","⑭は新規認定の申請時に準備できない場合には、現地審査時までに実施しその記録を保持してください。"]
[null,null,"①　認定申請書　（VLAC-VF100）"]
[null,null,"②　登記事項証明書（又は登記簿謄本）"]
[null,null,"③　試験所自身が記入したマネージメントシステム用チェックリスト　（様式VLAC-VF106）"]
[null,null,"④　認定取決め事項の同意書　（様式VLAC-VF108）"]
[null,null,"⑤　品質マニュアルのコピー"]
[null,null,"⑥　試験所組織図　（様式VLAC-VF126）"]
[{"$nulls":3},"試験所が大きな組織の一部である場合は、他の部署との関係を示す組織図も含む"]
[null,null,"⑦　試験所人員の氏名、役職、試験員の実施できる試験の資格"]
[{"$nulls":3},"組織図に記載がある場合は不要　（様式VLAC-VF109）"]
[null,null,"⑧　管理文書の台帳"]
[{"$nulls":3},"文書名、文書番号、作成者、承認者、最新の版、発行日などの管理項目が記載されているもの"]
[null,null,"⑨　試験機器台帳及びソフトウエア台帳の写し。認定範囲の試験に使用する試験器・測定器の台帳"]
[{"$nulls":3},"機器名、型番、製造会社、製造番号、校正周期などの管理項目が記載されているもの"]
[null,null,"⑩　認定範囲の試験を実施する試験設備の試験・測定系統図"]
[null,null,"⑪　認定範囲の試験報告書の見本または実物のコピー"]
[{"$nulls":3},"試験規格を追加する場合は、追加する規格の試験報告書（様式でも可）を含めること"]
[{"$nulls":3},"類似の試験規格はその中の代表的な規格でよい。"]
[{"$nulls":3},"実物のコピーは、依頼者名、試験品名などの開示に差障りがある場合その部分を塗りつぶしたもので可"]
[null,null,"⑫　認定範囲の試験の実績"]
[{"$nulls":3},"更新の場合は、前回審査以降の試験件数、試験報告書発行件数"]
[null,null,"⑬　技能試験の結果と考察（過去の履歴も記録してあると良い）　（様式VLAC-VF127）"]
[null,null,"⑭　内部監査とマネジメントレビューの記録"]
[null,null,"⑮　通信機器試験"]
[{"$nulls":3},"・手順書"]
[{"$nulls":3},"・試験場の検証データ"]
[{"$nulls":3},"・不確かさのバジェット"]
[{"$nulls":3},"・アンテナ校正データ"]
[{"$nulls":3},"・測定機器の検証データ、測定ソフトウェアの検証データ"]
[]
[]
[null,"サーベイランス"]
[null,null,"①　認定申請書　（VLAC-VF100）"]
[null,null,"②　事業概要書もしくは定款"]
[null,null,"③　品質マニュアルのコピー"]
[null,null,"④　認定取決め事項の同意書　（様式VLAC-VF108）"]
[null,null,"⑤　試験所組織図（前回更新審査以降変更があった場合）　（様式VLAC-VF126）"]
[{"$nulls":3},"試験所が大きな組織の一部である場合は、他の部署との関係を示す組織図も含む"]
[null,null,"⑥　試験所人員の氏名、役職、試験員の実施できる試験の資格"]
[{"$nulls":3},"組織図に記載がある場合は不要　（様式VLAC-VF109）"]
[null,null,"⑦　試験機器台帳及びソフトウエア台帳の写し。認定範囲の試験に使用する試験器・測定器の台帳"]
[{"$nulls":3},"機器名、型番、製造会社、製造番号、校正周期などの管理項目が記載されているもの"]
[null,null,"⑧　認定範囲の試験報告書の見本または実物のコピー"]
[{"$nulls":3},"類似の試験規格はその中の代表的な規格でよい。"]
[{"$nulls":3},"実物のコピーは、依頼者名、試験品名などの開示に差障りがある場合その部分を塗りつぶしたもので可"]
[null,null,"⑨　認定範囲の試験の実績"]
[{"$nulls":3},"前回審査以降の試験件数、試験報告書発行件数"]
[null,null,"⑩　技能試験の結果と考察（過去の履歴も記録してあると良い）　（様式VLAC-VF127）"]
[null,null,"⑪　内部監査とマネジメントレビューの記録"]
[null,null,"⑫　測定設備の変更・改修履歴"]
[{"$nulls":3},"測定設備の特性・性能に影響を与える大幅な変更・改修などを行った場合、変更・改修後の"]
[{"$nulls":3},"特性・性能確認資料（図、表、データ、写真）を添付のこと"]
[null,null,"⑬　苦情・異議申し立てを受けた場合はそれを処置した記録"]

{"sheet":"表紙","index":2,"n_rows":110,"n_cols":33,"rows_kept":110,"merged":[[1,22,1,25],[1,27,1,28],[1,30,1,31],[6,30,7,37],[10,8,10,14],[10,15,10,18],[10,19,10,26],[12,8,12,14],[12,15,12,18],[12,19,12,26],[14,8,14,14],[14,15,14,18],[14,19,14,26],[16,8,16,14],[16,15,16,18],[16,19,16,29],[18,8,18,14],[18,15,18,18],[18,19,18,29],[24,10,24,32],[26,11,26,12],[26,14,26,16],[26,18,26,32],[28,10,28,32],[30,10,30,32],[32,11,32,12],[32,14,32,16],[32,18,32,32],[34,10,34,32],[36,10,36,32],[38,10,38,32],[40,10,40,32],[42,10,42,32],[50,4,50,23],[50,26,50,28],[53,4,53,5],[53,7,53,9],[55,4,55,29],[58,4,58,23],[58,26,58,28],[61,4,61,5],[61,7,61,9],[63,4,63,29],[66,4,66,23],[66,26,66,28],[69,4,69,5],[69,7,69,9],[71,4,71,29],[74,4,74,23],[74,26,74,28],[77,4,77,5],[77,7,77,9],[79,4,79,29],[82,4,82,23],[82,26,82,28],[85,4,85,5],[85,7,85,9],[87,4,87,29],[90,4,90,23],[90,26,90,28],[93,4,93,5],[93,7,93,9],[95,4,95,29],[98,4,98,23],[98,26,98,28],[101,4,101,5],[101,7,101,9],[103,4,103,29],[106,4,106,23],[106,26,106,28],[109,4,109,5],[109,7,109,9],[111,4,111,29]]}
["VLAC-VF100:2017(R11)"]
["発行年月日：2017年1月6日",{"$nulls":20},"西暦",{"$nulls":4},"年",null,null,"月",null,null,"日"]
[]
[null,"株式会社　電磁環境試験所認定センター　殿"]
["試験所認定・サーベイランス審査申請"]
["新規認定・認定更新・認定拡大・認定変更申請書"]
["初回サーベイランス・サーベイランス申請書",{"$nulls":29},"未チェック"]
[]
[null,null,"（申請種別）",{"$nulls":5},"新規認定審査"]
[]
[{"$nulls":8},"認定番号　第ＶＬＡＣ－",{"$nulls":10},"号の認定の更新審査(*1)"]
[]
[{"$nulls":8},"認定番号　第ＶＬＡＣ－",{"$nulls":10},"号の認定拡大(*1)"]
[]
[{"$nulls":8},"認定番号　第ＶＬＡＣ－",{"$nulls":10},"号の変更審査(*1)"]
[]
[{"$nulls":8},"認定番号　第ＶＬＡＣ－",{"$nulls":10},"号の初回サーベイランス審査(*1)"]
[]
[{"$nulls":8},"認定番号　第ＶＬＡＣ－",{"$nulls":10},"号のサーベイランス審査(*1)"]
[]
[{"$nulls":32},"(*1)認定番号の枝番は記入不要です。枝番は下記の試験場名称記入欄の（　）に入力してください。"]
[]
["審査費用は貴社の請求書に従い指定金融機関に振り込みます。"]
[]
[{"$nulls":8},"試験所名（申請者/法人名）","："]
[]
[{"$nulls":8},"所在地","：","〒",null,null,"－"]
[]
[{"$nulls":8},"代表者の所属","："]
[]
[{"$nulls":8},"氏名","："]
[]
[null,null,"連絡担当者",{"$nulls":5},"住所","：","〒",null,null,"－"]
[]
[{"$nulls":8},"所属","："]
[]
[{"$nulls":8},"氏名","："]
[]
[{"$nulls":8},"電話番号","："]
[]
[{"$nulls":8},"FAX番号","："]
[]
[{"$nulls":8},"E-mail","："]
[]
[{"$nulls":32},"(*1)認定番号の枝番は記入不要です。枝番は下記の試験場名称記入欄の（　）に入力してください。"]
[]
[]
[null,"１．試験場名称"]
[null,null,"（申請する試験場を全てご記入下さい。VR100第5条(1)項に従った主試験場には□にチェックを入れて下さい。）"]
[{"$nulls":3},"試験場名称",{"$nulls":21},"枝番号"]
[{"$nulls":25},"（",{"$nulls":3},"）"]
[]
[{"$nulls":3},"住所"]
[{"$nulls":3},"〒",null,null,"－"]
[]
[]
[]
[{"$nulls":3},"試験場名称",{"$nulls":21},"枝番号"]
[{"$nulls":25},"（",{"$nulls":3},"）"]
[]
[{"$nulls":3},"住所"]
[{"$nulls":3},"〒",null,null,"－"]
[]
[]
[]
[{"$nulls":3},"試験場名称",{"$nulls":21},"枝番号"]
[{"$nulls":25},"（",{"$nulls":3},"）"]
[]
[{"$nulls":3},"住所"]
[{"$nulls":3},"〒",null,null,"－"]
[]
[]
[]
[{"$nulls":3},"試験場名称",{"$nulls":21},"枝番号"]
[{"$nulls":25},"（",{"$nulls":3},"）"]
[]
[{"$nulls":3},"住所"]
[{"$nulls":3},"〒",null,null,"－"]
[]
[]
[]
[{"$nulls":3},"試験場名称",{"$nulls":21},"枝番号"]
[{"$nulls":25},"（",{"$nulls":3},"）"]
[]
[{"$nulls":3},"住所"]
[{"$nulls":3},"〒",null,null,"－"]
[]
[]
[]
[{"$nulls":3},"試験場名称",{"$nulls":21},"枝番号"]
[{"$nulls":25},"（",{"$nulls":3},"）"]
[]
[{"$nulls":3},"住所"]
[{"$nulls":3},"〒",null,null,"－"]
[]
[]
[]
[{"$nulls":3},"試験場名称",{"$nulls":21},"枝番号"]
[{"$nulls":25},"（",{"$nulls":3},"）"]
[]
[{"$nulls":3},"住所"]
[{"$nulls":3},"〒",null,null,"－"]
[]
[]
[]
[{"$nulls":3},"試験場名称",{"$nulls":21},"枝番号"]
[{"$nulls":25},"（",{"$nulls":3},"）"]
[]
[{"$nulls":3},"住所"]
[{"$nulls":3},"〒",null,null,"－"]

{"sheet":"基本情報入力","index":3,"n_rows":70,"n_cols":58,"rows_kept":70,"merged":[[2,2,2,21],[2,24,2,26],[5,2,5,3],[5,5,5,7],[6,2,6,27],[64,1,69,3],[64,4,65,8],[64,9,65,12],[64,13,65,15],[64,16,65,18],[64,19,65,21],[64,22,65,24],[64,25,65,29],[64,30,65,34],[66,4,68,8],[66,9,68,12],[66,13,68,15],[66,16,68,18],[66,19,68,21],[66,22,68,24],[66,25,68,29],[66,30,68,34],[69,4,69,7],[69,14,69,17],[69,22,69,25]]}
[null,"2．試験場名称"]
[{"$nulls":23},"枝番号"]
[{"$nulls":23},"（",{"$nulls":3},"）"]
[]
[null,"住所"]
[null,"〒",null,null,"－"]
[]
[]
[]
[null,"3．申請試験項目（申請する試験項目にチェックしてください。）",{"$nulls":50},"項番","階層","表示タイプ","チェック内容","枝番設定","試験項目コード"]
[null,null,"エミッション",{"$nulls":49},1,1,0,false,null,"項目_エミ"]
[{"$nulls":3},"放射妨害波（FCC、CISPR11関連規格の1GHz超試験を含む）",{"$nulls":48},2,2,0,false,null,"項目_エミ_放射妨害波"]
[{"$nulls":3},"伝導妨害波",{"$nulls":48},3,2,0,false,null,"項目_エミ_伝導妨害波"]
[null,null,"イミュニティ",{"$nulls":49},4,1,0,false,null,"項目_イミ"]
[{"$nulls":3},"静電気",{"$nulls":48},5,2,0,false,null,"項目_イミ_静電気"]
[{"$nulls":3},"放射電磁界",{"$nulls":48},6,2,0,false,null,"項目_イミ_放射電磁界"]
[{"$nulls":3},"放射磁界",{"$nulls":48},7,2,0,false,null,"項目_イミ_放射磁界"]
[{"$nulls":3},"電気的過度バースト",{"$nulls":48},8,2,0,false,null,"項目_イミ_電気的過渡バースト"]
[{"$nulls":3},"サージ",{"$nulls":48},9,2,0,false,null,"項目_イミ_サージ"]
[{"$nulls":3},"無線周波伝導妨害波",{"$nulls":48},10,2,0,false,null,"項目_イミ_無線周波伝導妨害"]
[{"$nulls":3},"電源電圧変動",{"$nulls":48},11,2,0,false,null,"項目_イミ_電源電圧変動"]
[null,null,"1GHz超放射妨害波エミッション(CISPR22関連規格, VCCI技術基準による1GHz超の試験）",{"$nulls":49},12,1,0,false,null,"項目_1GHz超放射妨害波エミ"]
[null,null,"放送受信機イミュニティ",{"$nulls":49},13,1,0,false,null,"項目_放送受信機イミ"]
[{"$nulls":3},"アンテナ端子",{"$nulls":48},14,2,0,false,null,"項目_放送受信機イミ_アンテナ端子"]
[{"$nulls":3},"電源端子無線周波伝導妨害波",{"$nulls":48},15,2,0,false,null,"項目_放送受信機イミ_電源端子"]
[{"$nulls":3},"筐体放射電磁界",{"$nulls":48},16,2,0,false,null,"項目_放送受信機イミ_筺体放射電磁界"]
[null,null,"放送受信機エミッション",{"$nulls":49},17,1,0,null,null,"項目_放送受信機エミ"]
[{"$nulls":3},"放射妨害波",{"$nulls":48},18,2,0,false,null,"項目_放送受信機エミ_放射妨害波"]
[{"$nulls":3},"伝導妨害波",{"$nulls":48},19,2,0,false,null,"項目_放送受信機エミ_伝導妨害波"]
[null,null,"電力送電機器イミュニティ",{"$nulls":49},20,1,0,false,null,"項目_電力送電機器イミ"]
[{"$nulls":3},"減衰振動波",{"$nulls":48},21,2,0,false,null,"項目_電力送電機器イミ_減衰振動波"]
[{"$nulls":3},"リング振動波",{"$nulls":48},22,2,0,false,null,"項目_電力送電機器イミ_リング振動波"]
[{"$nulls":3},"直流入力ポートリップル印加",{"$nulls":48},23,2,0,false,null,"項目_電力送電機器イミ_直流入力ポートリップル印加"]
[null,null,"電源高調波",{"$nulls":49},24,1,0,null,null,"項目_電源高調波"]
[{"$nulls":3},"高調波電流",{"$nulls":48},25,2,0,false,null,"項目_電源高調波_高調波電流"]
[{"$nulls":3},"電源電圧動揺",{"$nulls":48},26,2,0,false,null,"項目_電源高調波_電源電圧動揺"]
[null,null,"自動車・車載機器",{"$nulls":49},27,1,0,null,null,"項目_自動車車載機器"]
[{"$nulls":3},"ESA(車載部品)イミュニティ",{"$nulls":48},28,2,0,false,null,"項目_自動車車載機器_ESA(車載部品)イミュニティ"]
[{"$nulls":3},"ESA(車載部品)エミッション",{"$nulls":48},29,2,0,false,null,"項目_自動車車載機器_ESA(車載部品)エミッション"]
[{"$nulls":3},"自動車イミュニティ",{"$nulls":48},30,2,0,false,null,"項目_自動車車載機器_自動車イミュニティ"]
[{"$nulls":3},"自動車エミッション",{"$nulls":48},31,2,0,false,null,"項目_自動車車載機器_自動車エミッション"]
[null,null,"音響(空気伝搬騒音)",{"$nulls":49},32,1,0,null,null,"項目_空気伝搬騒音"]
[null,null,"通信機器性能１",{"$nulls":49},33,1,0,false,null,"項目_通信機器1"]
[{"$nulls":3},"送信電力",{"$nulls":48},34,2,0,false,null,"項目_通信機器1_送信電力"]
[{"$nulls":3},"スプリアス",{"$nulls":48},35,2,0,false,null,"項目_通信機器1_スプリアス"]
[{"$nulls":3},"信号特性",{"$nulls":48},36,2,0,false,null,"項目_通信機器1_信号特性"]
[null,null,"通信機器性能2",{"$nulls":49},37,1,0,null,null,"項目_通信機器2"]
[{"$nulls":3},"電磁界ばく露(局所比吸収率)",{"$nulls":48},38,2,0,false,null,"項目_通信機器2_電磁界ばく露_局所比吸収率"]
[{"$nulls":3},"電磁界ばく露(磁界強度)",{"$nulls":48},39,2,0,false,null,"項目_通信機器2_電磁界ばく露_磁界強度"]
[null,null,"通信機器性能3",{"$nulls":49},40,1,0,false,null,"項目_通信機器3"]
[{"$nulls":3},"公衆回線接続通信端末機器試験",{"$nulls":48},41,2,0,false,null,"項目_通信機器3_有線通信機器"]
[null,null,"環境",{"$nulls":49},42,1,0,false,null,"項目_環境"]
[{"$nulls":3},"国際エネルギースタープログラム",{"$nulls":48},43,2,0,false,null,"項目_環境_国際エネルギースタープログラム"]
[{"$nulls":3},"米国エネルギースタープログラム",{"$nulls":48},44,2,0,false,null,"項目_環境_米国エネルギースタープログラム"]
[{"$nulls":3},"消費電力",{"$nulls":48},45,2,0,false,null,"項目_環境_消費電力"]
[null,null,"製品安全",{"$nulls":49},46,1,0,false,null,"項目_製品安全"]
[{"$nulls":3},"家電製品",{"$nulls":48},47,2,0,false,null,"項目_製品安全_家電製品"]
[{"$nulls":3},"IT機器",{"$nulls":48},48,2,0,false,null,"項目_製品安全_IT機器"]
[{"$nulls":3},"AV機器",{"$nulls":48},49,2,0,false,null,"項目_製品安全_AV機器"]
[{"$nulls":3},"医用電気機器",{"$nulls":48},50,2,0,false,null,"項目_製品安全_医用電気機器"]
[{"$nulls":3},"制御機器・計測機器",{"$nulls":48},51,2,0,false,null,"項目_製品安全_制御機器計測機器"]
[]
[null,4,"英文認定証：",{"$nulls":6},"要",{"$nulls":3},"不要"]
[]
[null,"VLAC\n記入欄",null,null,"受付日",{"$nulls":4},"受付番号",{"$nulls":3},"管理費\n区分",null,null,"基本\n単位",null,null,"追加\n単位",null,null,"内部\n校正",null,null,"認定範囲の\n品質システム",{"$nulls":4},"備考"]
[]
[]
[]
[]
[{"$nulls":4},"現地審査：",{"$nulls":4},"有",null,null,"無",null,"審査員数：",{"$nulls":4},"人",null,null,"審査日数：",{"$nulls":4},"日"]

{"sheet":"英文名称入力","index":4,"n_rows":25,"n_cols":2,"rows_kept":25}
[]
[null,"英文ホームページ情報（入力必須）"]
[]
[null,"英文試験所名称"]
[]
[]
[null,"英文試験所所在地"]
[]
[]
[null,"英文試験場名称"]
[]
[]
[null,"英文試験場所在地"]
[]
[]
[null,"英文試験所責任者名(Contact Person)"]
[]
[null,"    　　　　 "]
[null,"英文試験所責任者職責タイトル"]
[]
[null,"    　　　　 "]
[null,"試験所責任者メールアドレス"]
[]
[]
[null,"外部への試験業務サービス"]

{"sheet":"試験区分入力","index":5,"n_rows":194,"n_cols":60,"rows_kept":194,"merged":[[1,0,1,17],[1,18,1,26],[1,27,1,34],[1,35,1,41],[1,42,1,44],[2,0,3,17],[2,18,2,19],[2,20,2,26],[2,27,3,34],[2,35,3,41],[2,42,3,44],[3,18,3,19],[3,20,3,26],[11,14,11,16],[13,12,13,14],[13,17,13,19],[16,14,16,16],[18,12,18,16],[18,18,18,22],[60,21,60,25],[60,27,60,31],[61,22,61,26],[61,28,61,32],[62,16,62,20],[62,22,62,26],[64,22,64,26],[64,28,64,32],[65,16,65,20],[65,22,65,26],[66,15,66,19],[66,21,66,25],[68,22,68,26],[68,28,68,32],[82,24,82,28],[82,30,82,34],[83,26,83,30],[83,32,83,36],[84,16,84,20],[84,22,84,26],[85,16,85,20],[85,22,85,26]]}
["複数の試験場がある場合はこのファイルを試験場毎に作成してください。"]
["試験場名称",{"$nulls":17},"試験場管理責任者名/所属",{"$nulls":8},"E-mail",{"$nulls":7},"電話番号",{"$nulls":6},"事務局記入"]
[{"$f":"基本情報入力!C3","v":0},{"$nulls":17},"名前"]
[{"$nulls":18},"所属"]
[null,"注１：下記に記載された試験区分の中で認定の対象となる区分を全てチェックしてください。",{"$nulls":54},"不使用カラム"]
[null,"注２：カッコ内に記載されている付属書が要求されている試験区分については、試験を実施する設備毎に該当する付属書。",{"$nulls":50},"項番","階層","表示タイプ",null,"枝番設定","試験区分コード","測定周波数範囲最小","測定周波数範囲最大"]
[null,null,"5．試験区分－電磁両立性 エミッション",{"$nulls":49},1,1,0,false,null,"エミ"]
[{"$nulls":3},"5.1．放射妨害波 （エンクロージャーポート）",{"$nulls":48},2,2,0,false,null,"エミ_放射_エンク"]
[{"$nulls":4},"放射妨害波電界強度試験",{"$nulls":47},3,3,0,null,null,"エミ_放射_エンク_妨害電界"]
[{"$nulls":5},"基準大地面上（付属書：VF102またはVF103）",{"$nulls":46},4,4,0,null,null,"エミ_放射_エンク_妨害電界_基準"]
[{"$nulls":5},"FCC, CISPR11関連の1GHz超試験も含む",{"$nulls":46},5,5,1]
[{"$nulls":6},"測定周波数範囲：30MHz～",{"$nulls":10},"GHz",{"$nulls":34},6,5,4,false,null,"エミ_放射_エンク_妨害電界_基準_測定周波数範囲","-",{"$f":"$O$12","v":0}]
[{"$nulls":5},"基準大地面上：車載機器試験(1m法)（付属書：VF170）",{"$nulls":46},7,4,0,false,null,"エミ_放射_エンク_妨害電界_基準_車載機器"]
[{"$nulls":6},"測定周波数範囲：",{"$nulls":8},"kHz～",{"$nulls":4},"GHz",{"$nulls":31},8,5,4,false,null,"エミ_放射_エンク_妨害電界_基準_車載機器_測定周波数範囲",{"$f":"$M$14","v":0},{"$f":"$R$14","v":0}]
[{"$nulls":5},"準自由空間（付属書：VF-152）",{"$nulls":46},9,4,0,false,null,"エミ_放射_エンク_妨害電界_準自由_VF152"]
[{"$nulls":5},"VCCI技術基準V-3、CISPR22/32関連規格、ANSI C63.4:2014を含む場合に適用",{"$nulls":46},10,5,1]
[{"$nulls":6},"測定周波数範囲：1GHz～",{"$nulls":10},"GHz",{"$nulls":34},11,5,4,false,null,"エミ_放射_エンク_妨害電界_準自由_VF152_1GHz","-",{"$f":"$O$17","v":0}]
[{"$nulls":5},"準自由空間（付属書：VF-153）",{"$nulls":46},12,4,0,false,null,"エミ_放射_エンク_妨害電界_準自由_VF153"]
[{"$nulls":6},"測定周波数範囲：（",{"$nulls":10},"～",{"$nulls":5},"）",{"$nulls":28},13,5,4,false,null,"エミ_放射_エンク_妨害電界_準自由_VF153_測定周波数範囲",{"$f":"$M$19","v":0},{"$f":"$S$19","v":0}]
[{"$nulls":4},"放射妨害波磁界強度試験",{"$nulls":47},14,3,0,null,null,"エミ_放射_エンク_妨害磁界"]
[{"$nulls":5},"ループアンテナ",{"$nulls":46},15,4,0,null,null,"エミ_放射_エンク_妨害磁界_ループアンテナ"]
[{"$nulls":5},"3軸ループ（ラージループ）",{"$nulls":46},16,4,0,null,null,"エミ_放射_エンク_妨害磁界_3軸ループ"]
[{"$nulls":5},"等方性プローブ",{"$nulls":46},17,4,0,null,null,"エミ_放射_エンク_妨害磁界_等方性プローブ"]
[{"$nulls":4},"その他の放射妨害波試験",{"$nulls":47},18,3,0,null,null,"エミ_放射_エンク_その他放射妨害波試験"]
[{"$nulls":3},"5.2．妨害波電力試験（AC電源ポート）",{"$nulls":48},19,2,0,null,null,"エミ_放射_エンク_妨害電力"]
[{"$nulls":4},"吸収クランプ (CMAD)",{"$nulls":47},20,3,0,null,null,"エミ_放射_エンク_妨害電力_CMAD_クランプ"]
[{"$nulls":3},"5.3．AC電源ポート伝導妨害波試験（付属書：VF104）",{"$nulls":48},21,2,0,null,null,"エミ_伝導_AC電源"]
[{"$nulls":4},"妨害波電圧試験",{"$nulls":47},22,3,0,null,null,"エミ_伝導_AC電源_妨害電圧"]
[{"$nulls":5},"AMN",{"$nulls":46},23,4,0,null,null,"エミ_伝導_AC電源_妨害電圧_AMN"]
[{"$nulls":5},"高インピーダンスプローブ",{"$nulls":46},24,4,0,null,null,"エミ_伝導_AC電源_妨害電圧_高インピーダンスプローブ"]
[{"$nulls":3},"5.4．通信ポート伝導妨害波試験（付属書：VF117）",{"$nulls":48},25,2,0,null,null,"エミ_伝導_通信"]
[{"$nulls":4},"妨害波電圧試験",{"$nulls":47},26,3,0,null,null,"エミ_伝導_通信_妨害電圧"]
[{"$nulls":5},"AAN",{"$nulls":46},27,4,0,null,null,"エミ_伝導_通信_妨害電圧_AAN"]
[{"$nulls":5},"容量性電圧プローブ",{"$nulls":46},28,4,0,null,null,"エミ_伝導_通信_妨害電圧_容量性電圧プローブ"]
[{"$nulls":4},"妨害波電流試験",{"$nulls":47},29,3,0,null,null,"エミ_伝導_通信_妨害電流"]
[{"$nulls":5},"電流プローブ",{"$nulls":46},30,4,0,null,null,"エミ_伝導_通信_妨害電流_電流プローブ"]
[{"$nulls":3},"5.5．DC電源ポート伝導妨害波試験 （付属書：VF171）",{"$nulls":48},31,2,0,null,null,"エミ_伝導_DC電源"]
[{"$nulls":4},"妨害波電圧試験",{"$nulls":47},32,3,0,null,null,"エミ_伝導_DC電源_妨害電圧"]
[{"$nulls":5},"AMN",{"$nulls":46},33,4,0,null,null,"エミ_伝導_DC電源_妨害電圧_AMN"]
[{"$nulls":5},"高インピーダンスプローブ",{"$nulls":46},34,4,0,null,null,"エミ_伝導_DC電源_妨害電圧_高インピーダンスプローブ"]
[{"$nulls":4},"車載機器伝導妨害波試験",{"$nulls":47},35,3,0,null,null,"エミ_伝導_DC電源_車載機器"]
[{"$nulls":3},"5.6．PLCポート伝導妨害波試験",{"$nulls":48},36,2,0,null,null,"エミ_伝導_PLC"]
[{"$nulls":4},"妨害波電流試験",{"$nulls":47},37,3,0,null,null,"エミ_伝導_PLC_妨害電流"]
[{"$nulls":5},"電流プローブ",{"$nulls":46},38,4,0,null,null,"エミ_伝導_PLC_妨害電流_電流プローブ"]
[{"$nulls":3},"5.7．アンテナポート、RFモジュレーター出力ポート、チューナポート、ファイバーポート伝導妨害波試験（付属書：VF117）",{"$nulls":48},39,2,0,null,null,"エミ_アンテナ"]
[{"$nulls":4},"妨害波電圧試験",{"$nulls":47},40,3,0,null,null,"エミ_アンテナ_妨害電圧"]
[{"$nulls":5},"AAN",{"$nulls":46},41,4,0,null,null,"エミ_アンテナ_妨害電圧_AAN"]
[{"$nulls":5},"容量性電圧プローブ",{"$nulls":46},42,4,0,null,null,"エミ_アンテナ_妨害電圧_容量性電圧プローブ"]
[{"$nulls":4},"妨害波電流試験",{"$nulls":47},43,3,0,null,null,"エミ_アンテナ_妨害電流"]
[{"$nulls":5},"電流プローブ",{"$nulls":46},44,4,0,null,null,"エミ_アンテナ_妨害電流_妨害電流_電流プローブ"]
[{"$nulls":4},"希望信号電圧および妨害波端子電圧試験",{"$nulls":47},45,3,0,null,null,"エミ_アンテナ_希望信号電圧および妨害端子電圧試験"]
[{"$nulls":5},"選択性高周波電圧計",{"$nulls":46},46,4,0,null,null,"エミ_アンテナ_希望信号電圧および妨害端子電圧試験_選択性高周波電圧計"]
[{"$nulls":4},"屋外ユニット局部発振放射電力試験",{"$nulls":47},47,3,0,null,null,"エミ_アンテナ_屋外ユニット局部発振放射電力試験"]
[null,null,"6．試験区分－電磁両立性イミュニティ",{"$nulls":49},48,1,0,null,null,"イミ"]
[{"$nulls":3},"6.1．静電気（VF128A）",{"$nulls":48},49,2,0,null,null,"イミ_静電気"]
[{"$nulls":4},"静電気放電試験",{"$nulls":47},50,3,0,null,null,"イミ_静電気_静電気放電"]
[{"$nulls":4},"IEC 61000-4-2/EN 61000-4-2",{"$nulls":47},51,3,0,null,null,"イミ_静電気_IEC61000_4_2"]
[{"$nulls":4},"ISO 10605",{"$nulls":47},52,3,0,null,null,"イミ_静電気_ISO_10605"]
[{"$nulls":3},"6.2．放射電磁界",{"$nulls":48},53,2,0,false,null,"イミ_放射電磁界"]
[{"$nulls":4},"放射電磁界イミュニティ試験(擬似自由空間アンテナ放射) (VF128B)",{"$nulls":47},54,3,0,false,null,"イミ_放射電磁界_放射電磁界イミ_疑似自由空間アンテナ放射"]
[{"$nulls":5},"IEC 61000-4-3/EN 61000-4-3　測定周波数範囲：（",{"$nulls":20},"～",{"$nulls":5},"）",{"$nulls":19},55,4,4,false,null,"イミ_放射電磁界_放射電磁界イミ_疑似自由空間アンテナ放射_IEC_61000_4_3",{"$f":"$V$61","v":0},{"$f":"$AB$61","v":0}]
[{"$nulls":5},"IEC 61000-4-22/EN 61000-4-22　測定周波数範囲：（",{"$nulls":21},"～",{"$nulls":5},"）",{"$nulls":18},56,4,4,false,null,"イミ_放射電磁界_放射電磁界イミ_疑似自由空間アンテナ放射_IEC_61000_4_22",{"$f":"$W$62","v":0},{"$f":"$AC$62","v":0}]
[{"$nulls":5},"ISO 11452-2　測定周波数範囲：（",{"$nulls":15},"～",{"$nulls":5},"）",{"$nulls":24},57,4,4,false,null,"イミ_放射電磁界_放射電磁界イミ_疑似自由空間アンテナ放射_ISO_11452_2",{"$f":"$Q$63","v":0},{"$f":"$W$63","v":0}]
[{"$nulls":4},"放射電磁界イミュニティ試験（TEMセル、ストリップライン）（VF128B-TEM）",{"$nulls":47},58,3,0,false,null,"イミ_放射電磁界_放射電磁界イミ_TEMセル"]
[{"$nulls":5},"IEC 61000-4-20/EN 61000-4-20　測定周波数範囲：（",{"$nulls":21},"～",{"$nulls":5},"）",{"$nulls":18},59,4,4,false,null,"イミ_放射電磁界_放射電磁界イミ_TEMセル_IEC_61000_4_20",{"$f":"$W$65","v":0},{"$f":"$AC$65","v":0}]
[{"$nulls":5},"ISO 11452-3　測定周波数範囲：（",{"$nulls":15},"～",{"$nulls":5},"）",{"$nulls":24},60,4,4,false,null,"イミ_放射電磁界_放射電磁界イミ_TEMセル_ISO_11452_3",{"$f":"$Q$66","v":0},{"$f":"$W$66","v":0}]
[{"$nulls":5},"ISO 11452-5　測定周波数範囲：（",{"$nulls":14},"～",{"$nulls":5},"）",{"$nulls":25},61,4,4,false,null,"イミ_放射電磁界_放射電磁界イミ_TEMセル_ISO_11452_5",{"$f":"$P$67","v":0},{"$f":"$V$67","v":0}]
[{"$nulls":4},"放射電磁界イミュニティ試験（反射箱）（VF128B-RVC）",{"$nulls":47},62,3,0,false,null,"イミ_放射電磁界_放射電磁界イミ_反射箱"]
[{"$nulls":5},"IEC 61000-4-21/EN 61000-4-21　測定周波数範囲：（",{"$nulls":21},"～",{"$nulls":5},"）",{"$nulls":18},63,4,4,false,null,"イミ_放射電磁界_放射電磁界イミ_反射箱_IEC_61000_4_21",{"$f":"$W$69","v":0},{"$f":"$AC$69","v":0}]
[{"$nulls":3},"6.3．電気的過渡バースト （VF128C）",{"$nulls":48},64,2,0,null,null,"イミ_電気的過渡バースト"]
[{"$nulls":4},"IEC 61000-4-4/EN 61000-4-4",{"$nulls":47},65,3,0,null,null,"イミ_電気的過渡バースト_IEC_61000_4_4"]
[{"$nulls":5},"電源ポート伝導イミュニティ試験",{"$nulls":46},66,4,0,null,null,"イミ_電気的過渡バースト_電源ポート伝導イミ"]
[{"$nulls":5},"通信／信号ポート伝導イミュニティ試験",{"$nulls":46},67,4,0,null,null,"イミ_電気的過渡バースト_通信_信号ポート伝導イミ"]
[{"$nulls":4},"ISO 7637-2 （CDN）",{"$nulls":47},68,3,0,null,null,"イミ_電気的過渡バースト_ISO_7637_2"]
[{"$nulls":4},"ISO 7637-3　（容量性結合器）",{"$nulls":47},69,3,0,null,null,"イミ_電気的過渡バースト_ISO_7637_3"]
[{"$nulls":3},"6.4．サージ  （VF128D）",{"$nulls":48},70,2,0,null,null,"イミ_サージ"]
[{"$nulls":4},"IEC 61000-4-5/EN 61000-4-5",{"$nulls":47},71,3,0,null,null,"イミ_サージ_IEC_61000_4_5"]
[{"$nulls":5},"電源ポートサージイミュニティ試験",{"$nulls":46},72,4,0,null,null,"イミ_サージ_電源ポートサージイミ"]
[{"$nulls":5},"通信／信号ポートサージイミュニティ試験",{"$nulls":46},73,4,0,null,null,"イミ_サージ_通信_信号ポートサージイミ"]
[{"$nulls":3},"6.5．無線周波伝導妨害波 （VF128E）",{"$nulls":48},74,2,0,false,null,"イミ_無線周波伝導妨害"]
[{"$nulls":4},"IEC 61000-4-6/EN 61000-4-6",{"$nulls":47},75,3,0,null,null,"イミ_無線周波伝導妨害_IEC_61000_4_6"]
[{"$nulls":4},"IEC 61000-4-16/EN 61000-4-16",{"$nulls":47},76,3,0,false,null,"イミ_無線周波伝導妨害_IEC_61000_4_16"]
[{"$nulls":5},"電源ポート無線周波伝導イミュニティ試験　測定周波数範囲：（",{"$nulls":23},"～",{"$nulls":5},"）",{"$nulls":16},77,4,4,false,null,"イミ_無線周波伝導妨害_電源ポート無線周波伝導イミ",{"$f":"$Y$83","v":0},{"$f":"$AE$83","v":0}]
[{"$nulls":5},"通信／信号ポート無線周波伝導イミュニティ試験　測定周波数範囲：（",{"$nulls":25},"～",{"$nulls":5},"）",{"$nulls":14},78,4,4,false,null,"イミ_無線周波伝導妨害_通信_信号ポート無線周波伝導イミ",{"$f":"$AA$84","v":0},{"$f":"$AG$84","v":0}]
[{"$nulls":5},"ISO 11452-4　測定周波数範囲：（",{"$nulls":15},"～",{"$nulls":5},"）",{"$nulls":24},79,4,4,false,null,"イミ_無線周波伝導妨害_ISO_11452_4",{"$f":"$Q$85","v":0},{"$f":"$W$85","v":0}]
[{"$nulls":5},"ISO 11452-9　測定周波数範囲：（",{"$nulls":15},"～",{"$nulls":5},"）",{"$nulls":24},80,4,4,false,null,"イミ_無線周波伝導妨害_ISO_11452_9",{"$f":"$Q$86","v":0},{"$f":"$W$86","v":0}]
[{"$nulls":3},"6.6．放射磁界 （VF128F）",{"$nulls":48},81,2,0,null,null,"イミ_放射磁界"]
[{"$nulls":4},"磁界イミュニティ試験（ループコイル、ヘルムホルツコイル）",{"$nulls":47},82,3,0,null,null,"イミ_放射磁界_電源周波数磁界イミ"]
[{"$nulls":5},"IEC 61000-4-8/EN 61000-4-8",{"$nulls":46},83,4,0,null,null,"イミ_放射磁界_電源周波数磁界イミ_IEC_61000_4_8"]
[{"$nulls":5},"IEC 61000-4-9/EN 61000-4-9",{"$nulls":46},84,4,0,null,null,"イミ_放射磁界_電源周波数磁界イミ_IEC_61000_4_9"]
[{"$nulls":5},"ISO 11452-8",{"$nulls":46},85,4,0,null,null,"イミ_放射磁界_電源周波数磁界イミ_ISO_11452_8"]
[{"$nulls":3},"6.7．電源電圧変動 （VF128G）",{"$nulls":48},86,2,0,null,null,"イミ_電源電圧変動"]
[{"$nulls":4},"電源電圧ディップ・瞬停試験",{"$nulls":47},87,3,0,null,null,"イミ_電源電圧変動_電源電圧ディップ瞬停"]
[{"$nulls":5},"IEC 61000-4-11/EN 61000-4-11",{"$nulls":46},88,4,0,null,null,"イミ_電源電圧変動_電源電圧ディップ瞬停_IEC_61000_4_11"]
[{"$nulls":5},"IEC 61000-4-29/EN 61000-4-29",{"$nulls":46},89,4,0,null,null,"イミ_電源電圧変動_電源電圧ディップ瞬停_IEC_61000_4_29"]
[{"$nulls":3},"6.8．放送受信機イミュニティ",{"$nulls":48},90,2,0,null,null,"イミ_放送受信機イミ"]
[{"$nulls":4},"2信号または3信号特性試験（S1）",{"$nulls":47},91,3,0,null,null,"イミ_放送受信機イミ_アンテナ端子_2信号または3信号特性"]
[{"$nulls":4},"電源ポート無線周波伝導妨害波試験（S2）",{"$nulls":47},92,3,0,null,null,"イミ_放送受信機イミ_電源端子無線周波伝導妨害_電源ポート"]
[{"$nulls":4},"電磁界イミュニティ試験（オープンストリップライン）（S3）",{"$nulls":47},93,3,0,null,null,"イミ_放送受信機イミ_放射電磁界_電磁界イミ_オープンストリップライン"]
[{"$nulls":4},"同軸遮蔽減衰量試験（S4）",{"$nulls":47},94,3,0,null,null,"イミ_放送受信機イミ_アンテナ端子_同軸遮蔽減衰量"]
[{"$nulls":3},"6.9．電力送電機器イミュニティ",{"$nulls":48},95,2,0,null,null,"イミ_電力送電機器イミュニティ"]
[{"$nulls":4},"減衰振動波",{"$nulls":47},96,3,0,null,null,"イミ_電力送電機器イミュニティ_減衰振動波"]
[{"$nulls":4},"リング振動波",{"$nulls":47},97,3,0,null,null,"イミ_電力送電機器イミュニティ_リング振動波"]
[{"$nulls":4},"直流入力ポートリップル印加",{"$nulls":47},98,3,0,null,null,"イミ_電力送電機器イミュニティ_直流入力ポートリップル印加"]
[null,null,"7．試験区分－電源高調波",{"$nulls":49},99,1,0,null,null,"電源高調波"]
[{"$nulls":3},"7.1．電源高調波歪",{"$nulls":48},100,2,0,null,null,"電源高調波_電源高調波歪"]
[{"$nulls":4},"高調波電流試験",{"$nulls":47},101,3,0,null,null,"電源高調波_電源高調波歪_高調波電流"]
[{"$nulls":3},"7.2．電源電圧動揺",{"$nulls":48},102,2,0,null,null,"電源高調波_電源電圧動揺"]
[{"$nulls":4},"フリッカー試験",{"$nulls":47},103,3,0,null,null,"電源高調波_電源電圧動揺_フリッカー"]
[null,null,"8．試験区分－音響",{"$nulls":49},104,1,0,null,null,"音響"]
[{"$nulls":3},"8.1．空気伝搬騒音",{"$nulls":48},105,2,0,null,null,"音響_空気伝搬騒音"]
[{"$nulls":4},"空気伝搬騒音試験（付属書：VF154）",{"$nulls":47},106,3,0,null,null,"音響_空気伝搬騒音_空気伝搬騒音"]
[null,null,"9．試験区分－通信機器性能 １",{"$nulls":49},107,1,0,null,null,"通信機器性能"]
[{"$nulls":3},"9.1．送信電力",{"$nulls":48},108,2,0,null,null,"通信機器性能_送信電力"]
[{"$nulls":4},"アンテナ端子出力電力",{"$nulls":47},109,3,0,null,null,"通信機器性能_送信電力_アンテナ端子出力電力"]
[{"$nulls":5},"EIA/TIA-603-C",{"$nulls":46},110,4,0,null,null,"通信機器性能_送信電力_アンテナ端子出力電力_EIA_TIA_603_C"]
[{"$nulls":5},"FCC Part2(2.1046)",{"$nulls":46},111,4,0,null,null,"通信機器性能_送信電力_アンテナ端子出力電力_FCC_Part2"]
[{"$nulls":4},"放射電力(置換)",{"$nulls":47},112,3,0,null,null,"通信機器性能_送信電力_放射電力_置換"]
[{"$nulls":5},"EIA/TIA-603-C",{"$nulls":46},113,4,0,null,null,"通信機器性能_送信電力_放射電力_置換_EIA_TIA_603_C"]
[{"$nulls":5},"FCC Part2(2.1053)",{"$nulls":46},114,4,0,null,null,"通信機器性能_送信電力_放射電力_置換_FCC_Part2"]
[{"$nulls":3},"9.2．スプリアス",{"$nulls":48},115,2,0,null,null,"通信機器性能_スプリアス"]
[{"$nulls":4},"端子電圧（キャリア比）",{"$nulls":47},116,3,0,null,null,"通信機器性能_スプリアス_端子電圧"]
[{"$nulls":5},"EIA/TIA-603-C",{"$nulls":46},117,4,0,null,null,"通信機器性能_スプリアス_端子電圧_EIA_TIA_603_C"]
[{"$nulls":5},"FCC Part2(2.1051)",{"$nulls":46},118,4,0,null,null,"通信機器性能_スプリアス_端子電圧_FCC_Part2"]
[{"$nulls":4},"放射電界強度",{"$nulls":47},119,3,0,null,null,"通信機器性能_スプリアス_放射電界強度"]
[{"$nulls":5},"EIA/TIA-603-C",{"$nulls":46},120,4,0,null,null,"通信機器性能_スプリアス_放射電界強度_EIA_TIA_603_C"]
[{"$nulls":5},"FCC Part2(2.1053)",{"$nulls":46},121,4,0,null,null,"通信機器性能_スプリアス_放射電界強度_FCC_Part2"]
[{"$nulls":3},"9.3．信号特性",{"$nulls":48},122,2,0,null,null,"通信機器性能_信号特性"]
[{"$nulls":4},"周波数安定度",{"$nulls":47},123,3,0,null,null,"通信機器性能_信号特性_周波数安定度"]
[{"$nulls":5},"EIA/TIA-603-C",{"$nulls":46},124,4,0,null,null,"通信機器性能_信号特性_周波数安定度_EIA_TIA_603_C"]
[{"$nulls":5},"FCC Part2(2.1055)",{"$nulls":46},125,4,0,null,null,"通信機器性能_信号特性_周波数安定度_FCC_Part2"]
[{"$nulls":4},"変調特性",{"$nulls":47},126,3,0,null,null,"通信機器性能_信号特性_変調特性"]
[{"$nulls":5},"EIA/TIA-603-C",{"$nulls":46},127,4,0,null,null,"通信機器性能_信号特性_変調特性_EIA_TIA_603_C"]
[{"$nulls":5},"FCC Part2(2.1047)",{"$nulls":46},128,4,0,null,null,"通信機器性能_信号特性_変調特性_FCC_Part2"]
[{"$nulls":4},"占有帯域幅",{"$nulls":47},129,3,0,null,null,"通信機器性能_信号特性_占有帯域幅"]
[{"$nulls":5},"EIA/TIA-603-C",{"$nulls":46},130,4,0,null,null,"通信機器性能_信号特性_占有帯域幅_EIA_TIA_603_C"]
[{"$nulls":5},"FCC Part2(2.1049)",{"$nulls":46},131,4,0,null,null,"通信機器性能_信号特性_占有帯域幅_FCC_Part2"]
[{"$nulls":4},"スペクトラム",{"$nulls":47},132,3,0,null,null,"通信機器性能_信号特性_スペクトラム"]
[{"$nulls":5},"EIA/TIA-603-C",{"$nulls":46},133,4,0,null,null,"通信機器性能_信号特性_スペクトラム_EIA_TIA_603_C"]
[{"$nulls":5},"FCC Part2(2.1057)",{"$nulls":46},134,4,0,null,null,"通信機器性能_信号特性_スペクトラム_FCC_Part2"]
[{"$nulls":3},"9.4．その他(FCC15)",{"$nulls":48},135,2,0,null,null,"通信機器性能_その他"]
[{"$nulls":4},"動作周波数",{"$nulls":47},136,3,0,null,null,"通信機器性能_その他_動作周波数"]
[{"$nulls":5},"ANSI C63.10",{"$nulls":46},137,4,0,null,null,"通信機器性能_その他_動作周波数_ANSI_63_10"]
[{"$nulls":5},"FCC Part15C",{"$nulls":46},138,4,0,null,null,"通信機器性能_その他_動作周波数_FCC_Part15_C"]
[{"$nulls":4},"周波数安定度",{"$nulls":47},139,3,0,null,null,"通信機器性能_その他_周波数安定度"]
[{"$nulls":5},"ANSI C63.10",{"$nulls":46},140,4,0,null,null,"通信機器性能_その他_周波数安定度_ANSI_63_10"]
[{"$nulls":5},"FCC Part15C",{"$nulls":46},141,4,0,null,null,"通信機器性能_その他_周波数安定度_FCC_Part15_C"]
[{"$nulls":4},"入力電圧",{"$nulls":47},142,3,0,null,null,"通信機器性能_その他_入力電圧"]
[{"$nulls":5},"ANSI C63.10",{"$nulls":46},143,4,0,null,null,"通信機器性能_その他_入力電圧_ANSI_63_10"]
[{"$nulls":5},"FCC Part15C",{"$nulls":46},144,4,0,null,null,"通信機器性能_その他_入力電圧_FCC_Part15_C"]
[{"$nulls":4},"チャンネル占有",{"$nulls":47},145,3,0,null,null,"通信機器性能_その他_チャンネル占有"]
[{"$nulls":5},"ANSI C63.10",{"$nulls":46},146,4,0,null,null,"通信機器性能_その他_チャンネル占有_ANSI_63_10"]
[{"$nulls":5},"FCC Part15C",{"$nulls":46},147,4,0,null,null,"通信機器性能_その他_チャンネル占有_FCC_Part15_C"]
[{"$nulls":4},"スペクトラム密度",{"$nulls":47},148,3,0,null,null,"通信機器性能_その他_スペクトラム密度"]
[{"$nulls":5},"ANSI C63.10",{"$nulls":46},149,4,0,null,null,"通信機器性能_その他_スペクトラム密度_ANSI_63_10"]
[{"$nulls":5},"FCC Part15C",{"$nulls":46},150,4,0,null,null,"通信機器性能_その他_スペクトラム密度_FCC_Part15_C"]
[{"$nulls":4},"アンテナ端子出力電圧",{"$nulls":47},151,3,0,null,null,"通信機器性能_その他_アンテナ端子出力電圧"]
[{"$nulls":5},"ANSI C63.10",{"$nulls":46},152,4,0,null,null,"通信機器性能_その他_アンテナ端子出力電圧_ANSI_63_10"]
[{"$nulls":5},"ANSI C63.17:1998",{"$nulls":46},153,4,0,null,null,"通信機器性能_その他_アンテナ端子出力電圧_ANSI_63_17_1998"]
[{"$nulls":5},"FCC Part15C",{"$nulls":46},154,4,0,null,null,"通信機器性能_その他_アンテナ端子出力電圧_FCC_Part15_C"]
[{"$nulls":4},"尖頭伝導送信出力",{"$nulls":47},155,3,0,null,null,"通信機器性能_その他_尖頭伝導送信出力"]
[{"$nulls":5},"ANSI C63.10",{"$nulls":46},156,4,0,null,null,"通信機器性能_その他_尖頭伝導送信出力_ANSI_63_10"]
[{"$nulls":5},"FCC Part15E",{"$nulls":46},157,4,0,null,null,"通信機器性能_その他_尖頭伝導送信出力_FCC_Part15_E"]
[{"$nulls":4},"放射帯域幅",{"$nulls":47},158,3,0,null,null,"通信機器性能_その他_放射帯域幅"]
[{"$nulls":5},"ANSI C63.10",{"$nulls":46},159,4,0,null,null,"通信機器性能_その他_放射帯域幅_ANSI_63_10"]
[{"$nulls":5},"FCC Part15E",{"$nulls":46},160,4,0,null,null,"通信機器性能_その他_放射帯域幅_FCC_Part15_E"]
[{"$nulls":4},"尖頭電力スペクトラム密度",{"$nulls":47},161,3,0,null,null,"通信機器性能_その他_尖頭電力スペクトラム密度"]
[{"$nulls":5},"ANSI C63.10",{"$nulls":46},162,4,0,null,null,"通信機器性能_その他_尖頭電力スペクトラム密度_ANSI_63_10"]
[{"$nulls":5},"FCC Part15E",{"$nulls":46},163,4,0,null,null,"通信機器性能_その他_尖頭電力スペクトラム密度_FCC_Part15_E"]
[{"$nulls":4},"最大偏位",{"$nulls":47},164,3,0,null,null,"通信機器性能_その他_最大偏位"]
[{"$nulls":5},"ANSI C63.10",{"$nulls":46},165,4,0,null,null,"通信機器性能_その他_最大偏位_ANSI_63_10"]
[{"$nulls":5},"FCC Part15E",{"$nulls":46},166,4,0,null,null,"通信機器性能_その他_最大偏位_FCC_Part15_E"]
[{"$nulls":3},"9.5．上記以外の試験",{"$nulls":48},167,2,0,null,null,"通信機器性能_上記以外の試験"]
[{"$nulls":4},"欧州規格に基づく試験",{"$nulls":47},168,3,0,null,null,"通信機器性能_上記以外の試験_欧州"]
[{"$nulls":4},"カナダ規格に基づく試験",{"$nulls":47},169,3,0,null,null,"通信機器性能_上記以外の試験_カナダ"]
[null,null,"10．試験区分－通信機器性能 ２",{"$nulls":49},170,1,0,null,null,"通信機器性能2"]
[{"$nulls":3},"10.1．電磁界ばく露",{"$nulls":48},171,2,0,null,null,"通信機器性能2_電磁界ばく露"]
[{"$nulls":4},"局所吸収率 (付属書：VF119)",{"$nulls":47},172,3,0,null,null,"通信機器性能2_電磁界ばく露_局所比吸収率"]
[{"$nulls":4},"磁界強度（磁界プローブ）",{"$nulls":47},173,3,0,null,null,"通信機器性能2_電磁界ばく露_磁界強度_磁界プローブ"]
[{"$nulls":4},"電界強度（電界プローブ）",{"$nulls":47},174,3,0,null,null,"通信機器性能2_電磁界ばく露_低周波磁界密度_等方性プローブ"]
[null,null,"11．試験区分－通信機器性能 ３",{"$nulls":49},175,1,0,null,null,"通信機器性能3"]
[{"$nulls":3},"11.1．公衆回線接続通信端末機器試験",{"$nulls":48},176,2,0,null,null,"通信機器性能3_有線通信機器"]
[null,null,"12．試験区分－環境（消費電力）（注：本項を申請する場合は、事前にVLACにご相談ください。）",{"$nulls":49},177,1,0,null,null,"環境"]
[{"$nulls":3},"12.1．消費電力",{"$nulls":48},178,2,0,null,null,"環境_消費電力"]
[{"$nulls":4},"標準消費電力量 (TEC)法",{"$nulls":47},179,3,0,null,null,"環境_消費電力_標準消費電力量_TEC法"]
[{"$nulls":4},"動作モード (OM)法",{"$nulls":47},180,3,0,null,null,"環境_消費電力_動作モード_OM法"]
[{"$nulls":4},"家庭用電気冷蔵庫及び電気冷凍庫の特性及び試験",{"$nulls":47},181,3,0,null,null,"環境_消費電力_家庭用電気冷蔵庫及び電気冷凍庫の特性及び試験"]
[null,null,"13．試験区分－製品安全試験（注：本項を申請する場合は、事前にVLACにご相談ください。）",{"$nulls":49},182,1,0,null,null,"製品安全"]
[{"$nulls":3},"13.1．製品安全試験",{"$nulls":48},183,2,0,null,null,"製品安全_IEC"]
[{"$nulls":4},"家電製品",{"$nulls":47},184,3,0,null,null,"製品安全_IEC_家電製品"]
[{"$nulls":4},"IT機器",{"$nulls":47},185,3,0,null,null,"製品安全_IEC_IT機器"]
[{"$nulls":4},"AV機器",{"$nulls":47},186,3,0,null,null,"製品安全_IEC_AV機器"]
[{"$nulls":4},"医用電気機器",{"$nulls":47},187,3,0,null,null,"製品安全_IEC_医用電気機器"]
[{"$nulls":4},"制御機器・計測機器",{"$nulls":47},188,3,0,null,null,"製品安全_IEC_制御機器計測機器"]

{"sheet":"試験規格入力","index":6,"n_rows":577,"n_cols":63,"rows_kept":577,"merged":[[1,0,1,17],[1,18,1,26],[1,27,1,34],[1,35,1,41],[1,42,1,44],[2,0,3,17],[2,18,2,19],[2,20,2,26],[2,27,3,34],[2,35,3,41],[2,42,2,44],[3,18,3,19],[3,20,3,26],[3,42,3,44],[111,2,111,12],[111,13,111,14],[111,15,111,25],[111,26,111,27],[112,2,112,12],[112,13,112,14],[112,15,112,25],[112,26,112,27],[113,2,113,12],[113,13,113,14],[113,15,113,25],[113,26,113,27],[114,2,114,12],[114,13,114,14],[114,15,114,25],[114,26,114,27],[115,2,115,12],[115,13,115,14],[115,15,115,25],[115,26,115,27],[116,2,116,12],[116,13,116,14],[116,15,116,25],[116,26,116,27],[117,2,117,12],[117,13,117,14],[117,15,117,25],[117,26,117,27],[118,2,118,12],[118,13,118,14],[118,15,118,25],[118,26,118,27],[119,2,119,12],[119,13,119,14],[119,15,119,25],[119,26,119,27],[120,2,120,12],[120,13,120,14],[120,15,120,25],[120,26,120,27],[121,2,121,12],[121,13,121,14],[121,15,121,25],[121,26,121,27],[177,2,177,12],[177,13,177,14],[177,15,177,25],[177,26,177,27],[178,2,178,12],[178,13,178,14],[178,15,178,25],[178,26,178,27],[179,2,179,12],[179,13,179,14],[179,15,179,25],[179,26,179,27],[180,2,180,12],[180,13,180,14],[180,15,180,25],[180,26,180,27],[181,2,181,12],[181,13,181,14],[181,15,181,25],[181,26,181,27],[182,2,182,12],[182,13,182,14],[182,15,182,25],[182,26,182,27],[183,2,183,12],[183,13,183,14],[183,15,183,25],[183,26,183,27],[184,2,184,12],[184,13,184,14],[184,15,184,25],[184,26,184,27],[185,2,185,12],[185,13,185,14],[185,15,185,25],[185,26,185,27],[186,2,186,12],[186,13,186,14],[186,15,186,25],[186,26,186,27],[187,2,187,12],[187,13,187,14],[187,15,187,25],[187,26,187,27],[222,2,222,12],[222,13,222,14],[222,15,222,25],[222,26,222,27],[223,2,223,12],[223,13,223,14],[223,15,223,25],[223,26,223,27],[224,2,224,12],[224,13,224,14],[224,15,224,25],[224,26,224,27],[225,2,225,12],[225,13,225,14],[225,15,225,25],[225,26,225,27],[226,2,226,12],[226,13,226,14],[226,15,226,25],[226,26,226,27],[227,2,227,12],[227,13,227,14],[227,15,227,25],[227,26,227,27],[228,2,228,12],[228,13,228,14],[228,15,228,25],[228,26,228,27],[229,2,229,12],[229,13,229,14],[229,15,229,25],[229,26,229,27],[230,2,230,12],[230,13,230,14],[230,15,230,25],[230,26,230,27],[231,2,231,12],[231,13,231,14],[231,15,231,25],[231,26,231,27],[232,2,232,12],[232,13,232,14],[232,15,232,25],[232,26,232,27],[241,2,241,12],[241,13,241,14],[241,15,241,25],[241,26,241,27],[242,2,242,12],[242,13,242,14],[242,15,242,25],[242,26,242,27],[243,2,243,12],[243,13,243,14],[243,15,243,25],[243,26,243,27],[244,2,244,12],[244,13,244,14],[244,15,244,25],[244,26,244,27],[245,2,245,12],[245,13,245,14],[245,15,245,25],[245,26,245,27],[246,2,246,12],[246,13,246,14],[246,15,246,25],[246,26,246,27],[247,2,247,12],[247,13,247,14],[247,15,247,25],[247,26,247,27],[248,2,248,12],[248,13,248,14],[248,15,248,25],[248,26,248,27],[249,2,249,12],[249,13,249,14],[249,15,249,25],[249,26,249,27],[250,2,250,12],[250,13,250,14],[250,15,250,25],[250,26,250,27],[251,2,251,12],[251,13,251,14],[251,15,251,25],[251,26,251,27],[270,2,270,12],[270,13,270,14],[270,15,270,25],[270,26,270,27],[271,2,271,12],[271,13,271,14],[271,15,271,25],[271,26,271,27],[272,2,272,12],[272,13,272,14],[272,15,272,25],[272,26,272,27],[273,2,273,12],[273,13,273,14],[273,15,273,25],[273,26,273,27],[274,2,274,12],[274,13,274,14],[274,15,274,25],[274,26,274,27],[275,2,275,12],[275,13,275,14],[275,15,275,25],[275,26,275,27],[276,2,276,12],[276,13,276,14],[276,15,276,25],[276,26,276,27],[277,2,277,12],[277,13,277,14],[277,15,277,25],[277,26,277,27],[278,2,278,12],[278,13,278,14],[278,15,278,25],[278,26,278,27],[279,2,279,12],[279,13,279,14],[279,15,279,25],[279,26,279,27],[280,2,280,12],[280,13,280,14],[280,15,280,25],[280,26,280,27],[324,9,324,10],[324,12,324,13],[324,15,324,16],[324,18,324,19],[324,21,324,22],[324,24,324,25],[324,27,324,28],[343,2,343,12],[343,13,343,14],[343,15,343,25],[343,26,343,27],[344,2,344,12],[344,13,344,14],[344,15,344,25],[344,26,344,27],[345,2,345,12],[345,13,345,14],[345,15,345,25],[345,26,345,27],[346,2,346,12],[346,13,346,14],[346,15,346,25],[346,26,346,27],[347,2,347,12],[347,13,347,14],[347,15,347,25],[347,26,347,27],[348,2,348,12],[348,13,348,14],[348,15,348,25],[348,26,348,27],[349,2,349,12],[349,13,349,14],[349,15,349,25],[349,26,349,27],[350,2,350,12],[350,13,350,14],[350,15,350,25],[350,26,350,27],[351,2,351,12],[351,13,351,14],[351,15,351,25],[351,26,351,27],[352,2,352,12],[352,13,352,14],[352,15,352,25],[352,26,352,27],[353,2,353,12],[353,13,353,14],[353,15,353,25],[353,26,353,27],[383,2,383,12],[383,13,383,14],[383,15,383,25],[383,26,383,27],[384,2,384,12],[384,13,384,14],[384,15,384,25],[384,26,384,27],[385,2,385,12],[385,13,385,14],[385,15,385,25],[385,26,385,27],[386,2,386,12],[386,13,386,14],[386,15,386,25],[386,26,386,27],[387,2,387,12],[387,13,387,14],[387,15,387,25],[387,26,387,27],[388,2,388,12],[388,13,388,14],[388,15,388,25],[388,26,388,27],[389,2,389,12],[389,13,389,14],[389,15,389,25],[389,26,389,27],[390,2,390,12],[390,13,390,14],[390,15,390,25],[390,26,390,27],[391,2,391,12],[391,13,391,14],[391,15,391,25],[391,26,391,27],[392,2,392,12],[392,13,392,14],[392,15,392,25],[392,26,392,27],[393,2,393,12],[393,13,393,14],[393,15,393,25],[393,26,393,27],[401,2,401,12],[401,13,401,14],[401,15,401,25],[401,26,401,27],[402,2,402,12],[402,13,402,14],[402,15,402,25],[402,26,402,27],[403,2,403,12],[403,13,403,14],[403,15,403,25],[403,26,403,27],[404,2,404,12],[404,13,404,14],[404,15,404,25],[404,26,404,27],[405,2,405,12],[405,13,405,14],[405,15,405,25],[405,26,405,27],[406,2,406,12],[406,13,406,14],[406,15,406,25],[406,26,406,27],[407,2,407,12],[407,13,407,14],[407,15,407,25],[407,26,407,27],[408,2,408,12],[408,13,408,14],[408,15,408,25],[408,26,408,27],[409,2,409,12],[409,13,409,14],[409,15,409,25],[409,26,409,27],[410,2,410,12],[410,13,410,14],[410,15,410,25],[410,26,410,27],[411,2,411,12],[411,13,411,14],[411,15,411,25],[411,26,411,27],[465,3,465,13],[465,14,465,15],[465,16,465,26],[465,27,465,28],[466,3,466,13],[466,14,466,15],[466,16,466,26],[466,27,466,28],[467,3,467,13],[467,14,467,15],[467,16,467,26],[467,27,467,28],[468,3,468,13],[468,14,468,15],[468,16,468,26],[468,27,468,28],[469,3,469,13],[469,14,469,15],[469,16,469,26],[469,27,469,28],[470,3,470,13],[470,14,470,15],[470,16,470,26],[470,27,470,28],[471,3,471,13],[471,14,471,15],[471,16,471,26],[471,27,471,28],[472,3,472,13],[472,14,472,15],[472,16,472,26],[472,27,472,28],[473,3,473,13],[473,14,473,15],[473,16,473,26],[473,27,473,28],[474,3,474,13],[474,14,474,15],[474,16,474,26],[474,27,474,28],[475,3,475,13],[475,14,475,15],[475,16,475,26],[475,27,475,28],[487,3,487,13],[487,14,487,15],[487,16,487,26],[487,27,487,28],[488,3,488,13],[488,14,488,15],[488,16,488,26],[488,27,488,28],[489,3,489,13],[489,14,489,15],[489,16,489,26],[489,27,489,28],[490,3,490,13],[490,14,490,15],[490,16,490,26],[490,27,490,28],[491,3,491,13],[491,14,491,15],[491,16,491,26],[491,27,491,28],[492,3,492,13],[492,14,492,15],[492,16,492,26],[492,27,492,28],[493,3,493,13],[493,14,493,15],[493,16,493,26],[493,27,493,28],[494,3,494,13],[494,14,494,15],[494,16,494,26],[494,27,494,28],[495,3,495,13],[495,14,495,15],[495,16,495,26],[495,27,495,28],[496,3,496,13],[496,14,496,15],[496,16,496,26],[496,27,496,28],[497,3,497,13],[497,14,497,15],[497,16,497,26],[497,27,497,28],[505,3,505,13],[505,14,505,15],[505,16,505,26],[505,27,505,28],[506,3,506,13],[506,14,506,15],[506,16,506,26],[506,27,506,28],[507,3,507,13],[507,14,507,15],[507,16,507,26],[507,27,507,28],[508,3,508,13],[508,14,508,15],[508,16,508,26],[508,27,508,28],[509,3,509,13],[509,14,509,15],[509,16,509,26],[509,27,509,28],[510,3,510,13],[510,14,510,15],[510,16,510,26],[510,27,510,28],[511,3,511,13],[511,14,511,15],[511,16,511,26],[511,27,511,28],[512,3,512,13],[512,14,512,15],[512,16,512,26],[512,27,512,28],[513,3,513,13],[513,14,513,15],[513,16,513,26],[513,27,513,28],[514,3,514,13],[514,14,514,15],[514,16,514,26],[514,27,514,28],[515,3,515,13],[515,14,515,15],[515,16,515,26],[515,27,515,28],[523,3,523,13],[523,14,523,15],[523,16,523,26],[523,27,523,28],[524,3,524,13],[524,14,524,15],[524,16,524,26],[524,27,524,28],[525,3,525,13],[525,14,525,15],[525,16,525,26],[525,27,525,28],[526,3,526,13],[526,14,526,15],[526,16,526,26],[526,27,526,28],[527,3,527,13],[527,14,527,15],[527,16,527,26],[527,27,527,28],[528,3,528,13],[528,14,528,15],[528,16,528,26],[528,27,528,28],[529,3,529,13],[529,14,529,15],[529,16,529,26],[529,27,529,28],[530,3,530,13],[530,14,530,15],[530,16,530,26],[530,27,530,28],[531,3,531,13],[531,14,531,15],[531,16,531,26],[531,27,531,28],[532,3,532,13],[532,14,532,15],[532,16,532,26],[532,27,532,28],[533,3,533,13],[533,14,533,15],[533,16,533,26],[533,27,533,28],[544,3,544,13],[544,14,544,15],[544,16,544,26],[544,27,544,28],[545,3,545,13],[545,14,545,15],[545,16,545,26],[545,27,545,28],[546,3,546,13],[546,14,546,15],[546,16,546,26],[546,27,546,28],[547,3,547,13],[547,14,547,15],[547,16,547,26],[547,27,547,28],[548,3,548,13],[548,14,548,15],[548,16,548,26],[548,27,548,28],[549,3,549,13],[549,14,549,15],[549,16,549,26],[549,27,549,28],[550,3,550,13],[550,14,550,15],[550,16,550,26],[550,27,550,28],[551,3,551,13],[551,14,551,15],[551,16,551,26],[551,27,551,28],[552,3,552,13],[552,14,552,15],[552,16,552,26],[552,27,552,28],[553,3,553,13],[553,14,553,15],[553,16,553,26],[553,27,553,28],[554,3,554,13],[554,14,554,15],[554,16,554,26],[554,27,554,28],[565,3,565,13],[565,14,565,15],[565,16,565,26],[565,27,565,28],[566,3,566,13],[566,14,566,15],[566,16,566,26],[566,27,566,28],[567,3,567,13],[567,14,567,15],[567,16,567,26],[567,27,567,28],[568,3,568,13],[568,14,568,15],[568,16,568,26],[568,27,568,28],[569,3,569,13],[569,14,569,15],[569,16,569,26],[569,27,569,28],[570,3,570,13],[570,14,570,15],[570,16,570,26],[570,27,570,28],[571,3,571,13],[571,14,571,15],[571,16,571,26],[571,27,571,28],[572,3,572,13],[572,14,572,15],[572,16,572,26],[572,27,572,28],[573,3,573,13],[573,14,573,15],[573,16,573,26],[573,27,573,28],[574,3,574,13],[574,14,574,15],[574,16,574,26],[574,27,574,28],[575,3,575,13],[575,14,575,15],[575,16,575,26],[575,27,575,28]]}
["複数の試験場がある場合はこのファイルを試験場毎に作成してください。"]
["試験場名称",{"$nulls":17},"試験場管理責任者名/所属",{"$nulls":8},"E-mail",{"$nulls":7},"電話番号",{"$nulls":6},"事務局記入"]
[{"$f":"IF(試験区分入力!A3=0,\"\",試験区分入力!A3)","v":""},{"$nulls":17},"名前",null,{"$f":"IF(試験区分入力!U3=0,\"\",試験区分入力!U3)","v":""},{"$nulls":6},{"$f":"IF(試験区分入力!AB3=0,\"\",試験区分入力!AB3)","v":""},{"$nulls":7},{"$f":"IF(試験区分入力!AJ3=0,\"\",試験区分入力!AJ3)","v":""}]
[{"$nulls":18},"所属",null,{"$f":"IF(試験区分入力!U4=0,\"\",試験区分入力!U4)","v":""}]
[null,"注１：下記に記載された試験区分の中で認定の対象となる規格を全てチェックしてください。",{"$nulls":50},"項番","階層","表示タイプ","チェック内容","枝番設定","試験規格コード","(新規格用)試験規格名称","(新規格用)試験規格名称英語","(新規格用)親試験規格名称","枝番内容","下位試験規格コード"]
[null,null,"14．試験規格－電磁両立性エミッション",{"$nulls":49},1,1,0,null,null,"エミッション"]
[{"$nulls":3},"VCCI技術基準 V-3",{"$nulls":48},2,2,0,null,null,"エミッション_VCCI技術基準V-3"]
[{"$nulls":3},"FCC Part15B　この項にチェックする場合は、申請書の【英文名称入力】シートを入力して下さい。",{"$nulls":48},3,2,0,null,null,"エミッション_FCC_Part15B"]
[{"$nulls":4},"Subpart B ITE等、非意図放射機器試験",{"$nulls":47},4,3,0,null,null,"エミッション_FCC_Part15B_SubB_情報処理装置等"]
[{"$nulls":5},"ANSI C63.4:2003",{"$nulls":46},5,4,0,null,null,"エミッション_FCC_Part15B_SubB_情報処理装置等_ANSI_63_4_2003"]
[{"$nulls":5},"ANSI C63.4:2009",{"$nulls":46},6,4,0,null,null,"エミッション_FCC_Part15B_SubB_情報処理装置等_ANSI_63_4_2009"]
[{"$nulls":5},"ANSI C63.4:2014",{"$nulls":46},7,4,0,null,null,"エミッション_FCC_Part15B_SubB_情報処理装置等_ANSI_63_4_2014"]
[{"$nulls":4},"Subpart B放送受信機試験",{"$nulls":47},8,3,0,null,null,"エミッション_FCC_Part15B_SubB_放送受信機試験"]
[{"$nulls":5},"ANSI C63.4に基づく放送受信(MP-2を含む)",{"$nulls":46},9,4,0,null,null,"エミッション_FCC_Part15B_SubB_放送受信機試験_放送受信"]
[{"$nulls":5},"他の受信機",{"$nulls":46},10,4,0,null,null,"エミッション_FCC_Part15B_SubB_放送受信機試験_他の受信機"]
[{"$nulls":3},"FCC Part18 (MP-5)　この項にチェックする場合は、申請書の【英文名称入力】シートを入力して下さい。",{"$nulls":48},11,2,0,null,null,"エミッション_FCC_Part18"]
[{"$nulls":3},"CISPR11",{"$nulls":48},12,2,0,null,null,"エミッション_CISPR11"]
[{"$nulls":3},"CISPR12",{"$nulls":48},13,2,0,null,null,"エミッション_CISPR12"]
[{"$nulls":3},"CISPR14-1",{"$nulls":48},15,2,0,null,null,"エミッション_CISPR14-1"]
[{"$nulls":3},"CISPR15",{"$nulls":48},16,2,0,null,null,"エミッション_CISPR15"]
[{"$nulls":3},"CISPR22",{"$nulls":48},17,2,0,null,null,"エミッション_CISPR22"]
[{"$nulls":3},"CISPR25",{"$nulls":48},18,2,0,null,null,"エミッション_CISPR25"]
[{"$nulls":3},"CISPR32",{"$nulls":48},19,2,0,null,null,"エミッション_CISPR32"]
[{"$nulls":3},"EN55011",{"$nulls":48},20,2,0,null,null,"エミッション_EN55011"]
[{"$nulls":3},"EN55012",{"$nulls":48},21,2,0,null,null,"エミッション_EN55012"]
[{"$nulls":3},"EN55014-1",{"$nulls":48},23,2,0,null,null,"エミッション_EN55014-1"]
[{"$nulls":3},"EN55015",{"$nulls":48},24,2,0,null,null,"エミッション_EN55015"]
[{"$nulls":3},"EN55022",{"$nulls":48},25,2,0,null,null,"エミッション_EN55022"]
[{"$nulls":3},"EN55025",{"$nulls":48},26,2,0,null,null,"エミッション_EN55025"]
[{"$nulls":3},"EN55032",{"$nulls":48},27,2,0,null,null,"エミッション_EN55032"]
[{"$nulls":3},"EN55103-1",{"$nulls":48},28,2,0,null,null,"エミッション_EN55103-1"]
[{"$nulls":3},"IEC61800-3",{"$nulls":48},29,2,0,null,null,"エミッション_IEC61800-3"]
[{"$nulls":3},"EN61800-3",{"$nulls":48},30,2,0,null,null,"エミッション_EN61800-3"]
[{"$nulls":3},"ISO22199",{"$nulls":48},31,2,0,null,null,"エミッション_ISO22199"]
[{"$nulls":3},"電気用品の雑音の強さの測定方法",{"$nulls":48},32,2,0,null,null,"エミッション_電気用品の雑音の強さの測定方法"]
[{"$nulls":5},"2章",{"$nulls":46},33,4,0,null,null,"エミッション_電気用品の雑音の強さの測定方法_2章"]
[{"$nulls":5},"3章",{"$nulls":46},34,4,0,null,null,"エミッション_電気用品の雑音の強さの測定方法_3章"]
[{"$nulls":5},"4章",{"$nulls":46},35,4,0,null,null,"エミッション_電気用品の雑音の強さの測定方法_4章"]
[{"$nulls":5},"5章",{"$nulls":46},36,4,0,null,null,"エミッション_電気用品の雑音の強さの測定方法_5章"]
[{"$nulls":5},"6章",{"$nulls":46},37,4,0,null,null,"エミッション_電気用品の雑音の強さの測定方法_6章"]
[{"$nulls":5},"7章",{"$nulls":46},38,4,0,null,null,"エミッション_電気用品の雑音の強さの測定方法_7章"]
[{"$nulls":5},"8章",{"$nulls":46},39,4,0,null,null,"エミッション_電気用品の雑音の強さの測定方法_8章"]
[{"$nulls":5},"9章",{"$nulls":46},40,4,0,null,null,"エミッション_電気用品の雑音の強さの測定方法_9章"]
[{"$nulls":3},"J55001",{"$nulls":48},41,2,0,null,null,"エミッション_J55001"]
[{"$nulls":3},"J55014-1",{"$nulls":48},43,2,0,null,null,"エミッション_J55014-1"]
[{"$nulls":3},"J55015",{"$nulls":48},44,2,0,null,null,"エミッション_J55015"]
[{"$nulls":3},"J55022",{"$nulls":48},45,2,0,null,null,"エミッション_J55022"]
[{"$nulls":3},"電波法施行規則",{"$nulls":48},47,2,0,null,null,"エミッション_電波法施行規則"]
[{"$nulls":4},"第四十六条の二の五（広帯域電力線搬送通信設備）",{"$nulls":47},48,3,0,null,null,"エミッション_電波法施行規則_電波法第46条の2の5"]
[{"$nulls":4},"第四十六条の七（電子レンジ又は電磁誘導加熱式調理器）",{"$nulls":47},49,3,0,null,null,"エミッション_電波法施行規則_電波法第46条の7"]
[{"$nulls":3},"AS/NZS CISPR11",{"$nulls":48},50,2,0,null,null,"エミッション_AS_NZS_CISPR11"]
[{"$nulls":3},"AS/NZS CISPR12",{"$nulls":48},51,2,0,null,null,"エミッション_AS_NZS_CISPR12"]
[{"$nulls":3},"AS/NZS CISPR14.1",{"$nulls":48},53,2,0,null,null,"エミッション_AS_NZS_CISPR14-1"]
[{"$nulls":3},"AS/NZS CISPR15",{"$nulls":48},54,2,0,null,null,"エミッション_AS_NZS_CISPR15"]
[{"$nulls":3},"AS/NZS CISPR22",{"$nulls":48},55,2,0,null,null,"エミッション_AS_NZS_CISPR22"]
[{"$nulls":3},"AS/NZS CISPR25",{"$nulls":48},56,2,0,null,null,"エミッション_AS_NZS_CISPR25"]
[{"$nulls":3},"AS/NZS CISPR32",{"$nulls":48},57,2,0,null,null,"エミッション_AS_NZS_CISPR32"]
[{"$nulls":3},"AS/NZS 3200.1.2",{"$nulls":48},58,2,0,null,null,"エミッション_AS_NZS_3200-1-2"]
[{"$nulls":3},"AS/NZS 61000.6.3",{"$nulls":48},59,2,0,null,null,"エミッション_AS_NZS_61000-6-3"]
[{"$nulls":3},"AS/NZS 61000.6.4",{"$nulls":48},60,2,0,null,null,"エミッション_AS_NZS_61000-6-4"]
[{"$nulls":3},"IEC 61131-2",{"$nulls":48},61,2,0,null,null,"エミッション_IEC61131-2"]
[{"$nulls":3},"EN 61131-2",{"$nulls":48},62,2,0,null,null,"エミッション_EN61131-2"]
[{"$nulls":3},"ICES-001",{"$nulls":48},63,2,0,null,null,"エミッション_ICES-001"]
[{"$nulls":3},"ICES-002",{"$nulls":48},64,2,0,null,null,"エミッション_ICES-002"]
[{"$nulls":3},"ICES-003",{"$nulls":48},65,2,0,null,null,"エミッション_ICES-003"]
[{"$nulls":3},"ICES-005",{"$nulls":48},66,2,0,null,null,"エミッション_ICES-005"]
[{"$nulls":3},"BETS-7",{"$nulls":48},67,2,0,null,null,"エミッション_BETS-7"]
[{"$nulls":3},"CNS 13803",{"$nulls":48},68,2,0,null,null,"エミッション_CNS13803"]
[{"$nulls":3},"CNS 13439",{"$nulls":48},69,2,0,null,null,"エミッション_CNS13439"]
[{"$nulls":3},"CNS 13438",{"$nulls":48},70,2,0,null,null,"エミッション_CNS13438"]
[{"$nulls":3},"CNS 13783-1",{"$nulls":48},71,2,0,null,null,"エミッション_CNS13783-1"]
[{"$nulls":3},"CNS 14115",{"$nulls":48},72,2,0,null,null,"エミッション_CNS14115"]
[{"$nulls":3},"K00013",{"$nulls":48},73,2,0,null,null,"エミッション_K00013"]
[{"$nulls":3},"K00014-1",{"$nulls":48},74,2,0,null,null,"エミッション_K00014-1"]
[{"$nulls":3},"K00015",{"$nulls":48},75,2,0,null,null,"エミッション_K00015"]
[{"$nulls":3},"KN15",{"$nulls":48},76,2,0,null,null,"エミッション_KN15"]
[{"$nulls":3},"K00022",{"$nulls":48},77,2,0,null,null,"エミッション_K00022"]
[{"$nulls":3},"KN22  ",{"$nulls":48},78,2,0,null,null,"エミッション_KN22"]
[{"$nulls":3},"GB13837",{"$nulls":48},79,2,0,null,null,"エミッション_GB13837"]
[{"$nulls":3},"GB4343.1",{"$nulls":48},80,2,0,null,null,"エミッション_GB4343_1"]
[{"$nulls":3},"GB9254",{"$nulls":48},81,2,0,null,null,"エミッション_GB9254"]
[{"$nulls":3},"GB 17743",{"$nulls":48},82,2,0,null,null,"エミッション_GB17743"]
[{"$nulls":3},"GOST R51318.13",{"$nulls":48},83,2,0,null,null,"エミッション_GOST_R51318_13"]
[{"$nulls":3},"GOST R51318.14.1",{"$nulls":48},84,2,0,null,null,"エミッション_GOST_R51318_14_1"]
[{"$nulls":3},"GOST R51318.15",{"$nulls":48},85,2,0,null,null,"エミッション_GOST_R51318_15"]
[{"$nulls":3},"GOST R51318.22",{"$nulls":48},86,2,0,null,null,"エミッション_GOST_R51318_22"]
[{"$nulls":3},"IEC61000-6-3",{"$nulls":48},87,2,0,null,null,"エミッション_IEC61000-6-3"]
[{"$nulls":3},"IEC61000-6-4",{"$nulls":48},88,2,0,null,null,"エミッション_IEC61000-6-4"]
[{"$nulls":3},"EN61000-6-3",{"$nulls":48},89,2,0,null,null,"エミッション_EN61000-6-3"]
[{"$nulls":3},"EN61000-6-4",{"$nulls":48},90,2,0,null,null,"エミッション_EN61000-6-4"]
[{"$nulls":3},"EN12015",{"$nulls":48},91,2,0,null,null,"エミッション_EN12015"]
[{"$nulls":3},"IEC 60533",{"$nulls":48},92,2,0,null,null,"エミッション_IEC60533"]
[{"$nulls":3},"EN 60533",{"$nulls":48},93,2,0,null,null,"エミッション_EN60533"]
[{"$nulls":3},"IEC 60945",{"$nulls":48},94,2,0,null,null,"エミッション_IEC60945"]
[{"$nulls":3},"EN 60945",{"$nulls":48},95,2,0,null,null,"エミッション_EN60945"]
[{"$nulls":3},"EN13309",{"$nulls":48},96,2,0,null,null,"エミッション_EN13309"]
[{"$nulls":3},"IEC62236-3-2",{"$nulls":48},97,2,0,null,null,"エミッション_IEC62236-3-2"]
[{"$nulls":3},"EN50121-3-2",{"$nulls":48},98,2,0,null,null,"エミッション_EN50121-3-2"]
[{"$nulls":3},"IEC62236-4",{"$nulls":48},99,2,0,null,null,"エミッション_IEC62236-4"]
[{"$nulls":3},"EN50121-4",{"$nulls":48},100,2,0,null,null,"エミッション_EN50121-4"]
[{"$nulls":3},"日本海事協会規格(船用材料機器)第７編１章（自動化機器および装置）",{"$nulls":48},101,2,0,null,null,"エミッション_日本海事協会規格第7編1章"]
[{"$nulls":3},"ICAS E10",{"$nulls":48},102,2,0,null,null,"エミッション_ICAS_E10"]
[{"$nulls":3},"IEC61326-1(製品個別要求条件IEC61326-2シリーズ)*",{"$nulls":48},103,2,0,null,null,"エミッション_IEC61326-1"]
[{"$nulls":3},"EN61326-1(製品個別要求条件IEC61326-2シリーズ)*",{"$nulls":48},104,2,0,null,null,"エミッション_EN61326-1"]
[{"$nulls":3},"IEC60601-1-2(製品個別要求条件IEC60601-2シリーズ)*",{"$nulls":48},105,2,0,null,null,"エミッション_IEC60601-1-2"]
[{"$nulls":3},"EN60601-1-2(製品個別要求条件EN60601-2シリーズ)*",{"$nulls":48},106,2,0,null,null,"エミッション_EN60601-1-2"]
[{"$nulls":3},"JIS C1806-1",{"$nulls":48},107,2,0,null,null,"エミッション_JIS_C1806-1"]
[{"$nulls":3},"JIS T0601-1-2(製品個別要求条件JIS T0601-2シリーズ)*",{"$nulls":48},108,2,0,null,null,"エミッション_JIS_T0601-1-2"]
[null,null,"* 特定の製品規格に限定する場合はご相談ください。",{"$nulls":49},109,2,1]
[null,null,"記載のない試験規格をご希望の場合はここにご記入ください",{"$nulls":49},110,2,2]
[null,null,"注：下記に記載の規格番号及び表記が認定証に記載されます",{"$nulls":49},110,2,1]
[null,null,"日本語規格番号",{"$nulls":10},"通則版",null,"英語規格番号",{"$nulls":10},"通則版",{"$nulls":25},110,2,1]
[{"$nulls":52},110,2,2,{"$f":"IF(C113= \"\",FALSE,TRUE)","v":false},null,{"$f":"IF(C113= \"\",\"\",\"エミッション_\" & C113)","v":""},{"$f":"IF(C113= \"\",\"\",C113)","v":""},{"$f":"IF(C113= \"\",\"\",IF(P113= \"\",\"\",P113))","v":""},"エミッション",null,"イミュニティ"]
[{"$nulls":52},110,2,2,false,null,"","","","エミッション",null,"イミュニティ"]
[{"$nulls":52},110,2,2,false,null,"","","","エミッション",null,"イミュニティ"]
[{"$nulls":52},110,2,2,false,null,"","","","エミッション",null,"イミュニティ"]
[{"$nulls":52},110,2,2,false,null,"","","","エミッション",null,"イミュニティ"]
[{"$nulls":52},110,2,2,false,null,"","","","エミッション",null,"イミュニティ"]
[{"$nulls":52},110,2,2,false,null,"","","","エミッション",null,"イミュニティ"]
[{"$nulls":52},110,2,2,false,null,"","","","エミッション",null,"イミュニティ"]
[{"$nulls":52},110,2,2,false,null,"","","","エミッション",null,"イミュニティ"]
[{"$nulls":52},110,2,2,false,null,"","","","エミッション",null,"イミュニティ"]
[null,null,"行追加",{"$nulls":49},110,2,1]
[null,null,"15．試験規格－電磁両立性イミュニティ",{"$nulls":49},111,1,0,null,null,"イミュニティ"]
[{"$nulls":3},"CISPR14-2",{"$nulls":48},112,2,0,null,null,"イミュニティ_CISPR14-2"]
[{"$nulls":3},"CISPR24",{"$nulls":48},114,2,0,null,null,"イミュニティ_CISPR24"]
[{"$nulls":3},"EN55014-2",{"$nulls":48},115,2,0,null,null,"イミュニティ_EN55014-2"]
[{"$nulls":3},"EN55024",{"$nulls":48},117,2,0,null,null,"イミュニティ_EN55024"]
[{"$nulls":3},"IEC61000-6-1",{"$nulls":48},118,2,0,null,null,"イミュニティ_IEC61000-6-1"]
[{"$nulls":3},"IEC61000-6-2",{"$nulls":48},119,2,0,null,null,"イミュニティ_IEC61000-6-2"]
[{"$nulls":3},"EN61000-6-1",{"$nulls":48},120,2,0,null,null,"イミュニティ_EN61000-6-1"]
[{"$nulls":3},"EN61000-6-2",{"$nulls":48},121,2,0,null,null,"イミュニティ_EN61000-6-2"]
[{"$nulls":3},"AS/NZS CISPR14.2",{"$nulls":48},122,2,0,null,null,"イミュニティ_AS_NZS_CISPR14-2"]
[{"$nulls":3},"AS/NZS CISPR24",{"$nulls":48},124,2,0,null,null,"イミュニティ_AS_NZS_CISPR24"]
[{"$nulls":3},"AS/NZS 3200.1.2",{"$nulls":48},125,2,0,null,null,"イミュニティ_AS_NZS_3200-1-2"]
[{"$nulls":3},"AS/NZS 61000.6.1",{"$nulls":48},126,2,0,null,null,"イミュニティ_AS_NZS_61000-6-1"]
[{"$nulls":3},"AS/NZS 61000.6.2",{"$nulls":48},127,2,0,null,null,"イミュニティ_AS_NZS_61000-6-2"]
[{"$nulls":3},"JIS C61000-6-1",{"$nulls":48},128,2,0,null,null,"イミュニティ_JIS_C61000-6-1"]
[{"$nulls":3},"JIS C61000-6-2",{"$nulls":48},129,2,0,null,null,"イミュニティ_JIS_C61000-6-2"]
[{"$nulls":3},"J1000",{"$nulls":48},130,2,0,null,null,"イミュニティ_J1000"]
[{"$nulls":3},"EN55103-2",{"$nulls":48},131,2,0,null,null,"イミュニティ_EN55103-2"]
[{"$nulls":3},"EN12016",{"$nulls":48},132,2,0,null,null,"イミュニティ_EN12016"]
[{"$nulls":3},"K00014-1",{"$nulls":48},133,2,0,null,null,"イミュニティ_K00014-1"]
[{"$nulls":3},"K00024",{"$nulls":48},135,2,0,null,null,"イミュニティ_K00024"]
[{"$nulls":3},"KN24",{"$nulls":48},136,2,0,null,null,"イミュニティ_KN24"]
[{"$nulls":3},"GB4343.2",{"$nulls":48},137,2,0,null,null,"イミュニティ_GB4343_2"]
[{"$nulls":3},"GOST R51318.14.2",{"$nulls":48},138,2,0,null,null,"イミュニティ_GOST_R51318_14_2"]
[{"$nulls":3},"GOST R51318.24",{"$nulls":48},139,2,0,null,null,"イミュニティ_GOST_R51318_24"]
[{"$nulls":3},"IEC61800-3",{"$nulls":48},140,2,0,null,null,"イミュニティ_IEC61800-3"]
[{"$nulls":3},"EN61800-3",{"$nulls":48},141,2,0,null,null,"イミュニティ_EN61800-3"]
[{"$nulls":3},"IEC 61326-3-1",{"$nulls":48},142,2,0,null,null,"イミュニティ_IEC61326-3-1"]
[{"$nulls":3},"EN 61326-3-2",{"$nulls":48},143,2,0,null,null,"イミュニティ_EN61326-3-2"]
[{"$nulls":3},"IEC 61547",{"$nulls":48},144,2,0,null,null,"イミュニティ_IEC61547"]
[{"$nulls":3},"EN 61547",{"$nulls":48},145,2,0,null,null,"イミュニティ_EN61547"]
[{"$nulls":3},"EN 50130-4",{"$nulls":48},146,2,0,null,null,"イミュニティ_EN50130-4"]
[{"$nulls":3},"IEC 60533",{"$nulls":48},147,2,0,null,null,"イミュニティ_IEC60533"]
[{"$nulls":3},"EN 60533",{"$nulls":48},148,2,0,null,null,"イミュニティ_EN60533"]
[{"$nulls":3},"IEC 60945",{"$nulls":48},149,2,0,null,null,"イミュニティ_IEC60945"]
[{"$nulls":3},"EN 60945",{"$nulls":48},150,2,0,null,null,"イミュニティ_EN60945"]
[{"$nulls":3},"EN13309",{"$nulls":48},151,2,0,null,null,"イミュニティ_EN13309"]
[{"$nulls":3},"IEC 62236-3-2",{"$nulls":48},152,2,0,null,null,"イミュニティ_IEC62236-3-2"]
[{"$nulls":3},"EN 50121-3-2",{"$nulls":48},153,2,0,null,null,"イミュニティ_EN50121-3-2"]
[{"$nulls":3},"IEC 62236-4",{"$nulls":48},154,2,0,null,null,"イミュニティ_IEC62236-4"]
[{"$nulls":3},"EN 50121-4",{"$nulls":48},155,2,0,null,null,"イミュニティ_EN50121-4"]
[{"$nulls":3},"ISO 22200",{"$nulls":48},156,2,0,null,null,"イミュニティ_ISO22200"]
[{"$nulls":3},"KN 61547",{"$nulls":48},157,2,0,null,null,"イミュニティ_KN61547"]
[{"$nulls":3},"日本海事協会規格(船用材料機器)第７編１章（自動化機器および装置）",{"$nulls":48},158,2,0,null,null,"イミュニティ_日本海事協会規格第7編1章"]
[{"$nulls":3},"ICAS E10",{"$nulls":48},159,2,0,null,null,"イミュニティ_ICAS_E10"]
[{"$nulls":3},"IEC61326-1(製品個別要求条件IEC61326-2シリーズ)*",{"$nulls":48},160,2,0,null,null,"イミュニティ_IEC61326-1"]
[{"$nulls":3},"EN61326-1(製品個別要求条件IEC61326-2シリーズ)*",{"$nulls":48},161,2,0,null,null,"イミュニティ_EN61326-1"]
[{"$nulls":3},"IEC60601-1-2(製品個別要求条件IEC60601-2シリーズ)*",{"$nulls":48},162,2,0,null,null,"イミュニティ_IEC60601-1-2"]
[{"$nulls":3},"EN60601-1-2(製品個別要求条件EN60601-2シリーズ)*",{"$nulls":48},163,2,0,null,null,"イミュニティ_EN60601-1-2"]
[{"$nulls":3},"JIS C1806-1",{"$nulls":48},164,2,0,null,null,"イミュニティ_JIS_C1806-1"]
[{"$nulls":3},"JIS T0601-1-2(製品個別要求条件JIS T0601-2シリーズ)*",{"$nulls":48},165,2,0,null,null,"イミュニティ_JIS_T0601-1-2"]
[null,null,"* 特定の製品規格に限定する場合はご相談ください。",{"$nulls":49},166,2,1]
[null,null,"記載のない試験規格をご希望の場合はここにご記入ください",{"$nulls":49},167,2,2]
[null,null,"注：下記に記載の規格番号及び表記が認定証に記載されます",{"$nulls":49},167,2,1]
[null,null,"日本語規格番号",{"$nulls":10},"通則版",null,"英語規格番号",{"$nulls":10},"通則版",{"$nulls":25},167,2,1]
[{"$nulls":52},167,2,2,{"$f":"IF(C179= \"\",FALSE,TRUE)","v":false},null,{"$f":"IF(C179= \"\",\"\",\"イミュニティ_\" & C179)","v":""},{"$f":"IF(C179= \"\",\"\",C179)","v":""},{"$f":"IF(C179= \"\",\"\",IF(P179= \"\",\"\",P179))","v":""},"イミュニティ",null,"電源高調波"]
[{"$nulls":52},167,2,2,false,null,"","","","イミュニティ",null,"電源高調波"]
[{"$nulls":52},167,2,2,false,null,"","","","イミュニティ",null,"電源高調波"]
[{"$nulls":52},167,2,2,false,null,"","","","イミュニティ",null,"電源高調波"]
[{"$nulls":52},167,2,2,false,null,"","","","イミュニティ",null,"電源高調波"]
[{"$nulls":52},167,2,2,false,null,"","","","イミュニティ",null,"電源高調波"]
[{"$nulls":52},167,2,2,false,null,"","","","イミュニティ",null,"電源高調波"]
[{"$nulls":52},167,2,2,false,null,"","","","イミュニティ",null,"電源高調波"]
[{"$nulls":52},167,2,2,false,null,"","","","イミュニティ",null,"電源高調波"]
[{"$nulls":52},167,2,2,false,null,"","","","イミュニティ",null,"電源高調波"]
[null,null,"行追加",{"$nulls":49},167,2,1]
[null,null,"16．試験規格－電源高調波",{"$nulls":49},168,1,0,null,null,"電源高調波"]
[{"$nulls":3},"IEC61000-3-2",{"$nulls":48},169,2,0,null,null,"電源高調波_IEC61000-3-2"]
[{"$nulls":3},"IEC61000-3-12",{"$nulls":48},170,2,0,null,null,"電源高調波_IEC61000-3-12"]
[{"$nulls":3},"IEC61000-3-3",{"$nulls":48},171,2,0,null,null,"電源高調波_IEC61000-3-3"]
[{"$nulls":3},"IEC61000-3-11",{"$nulls":48},172,2,0,null,null,"電源高調波_IEC61000-3-11"]
[{"$nulls":3},"JIS C61000-3-2",{"$nulls":48},173,2,0,null,null,"電源高調波_JIS_C61000-3-2"]
[{"$nulls":3},"IEC61000-6-3",{"$nulls":48},174,2,0,null,null,"電源高調波_IEC61000-6-3"]
[{"$nulls":3},"IEC61000-6-4",{"$nulls":48},175,2,0,null,null,"電源高調波_IEC61000-6-4"]
[{"$nulls":3},"EN61000-6-3",{"$nulls":48},176,2,0,null,null,"電源高調波_EN61000-6-3"]
[{"$nulls":3},"EN61000-6-4",{"$nulls":48},177,2,0,null,null,"電源高調波_EN61000-6-4"]
[{"$nulls":3},"EN61000-3-2",{"$nulls":48},178,2,0,null,null,"電源高調波_EN61000-3-2"]
[{"$nulls":3},"EN61000-3-12",{"$nulls":48},179,2,0,null,null,"電源高調波_EN61000-3-12"]
[{"$nulls":3},"EN61000-3-3",{"$nulls":48},180,2,0,null,null,"電源高調波_EN61000-3-3"]
[{"$nulls":3},"EN61000-3-11",{"$nulls":48},181,2,0,null,null,"電源高調波_EN61000-3-11"]
[{"$nulls":3},"AS/NZS 3200.1.2",{"$nulls":48},182,2,0,null,null,"電源高調波_AS_NZS_3200-1-2"]
[{"$nulls":3},"AS/NZS 61000.3.2",{"$nulls":48},183,2,0,null,null,"電源高調波_AS_NZS_61000-3-2"]
[{"$nulls":3},"AS/NZS 61000.3.12",{"$nulls":48},184,2,0,null,null,"電源高調波_AS_NZS_61000-3-12"]
[{"$nulls":3},"AS/NZS 61000.3.3",{"$nulls":48},185,2,0,null,null,"電源高調波_AS_NZS_61000-3-3"]
[{"$nulls":3},"AS/NZS 61000.3.11",{"$nulls":48},186,2,0,null,null,"電源高調波_AS_NZS_61000-3-11"]
[{"$nulls":3},"AS/NZS 61000.6.3",{"$nulls":48},187,2,0,null,null,"電源高調波_AS_NZS_61000-6-3"]
[{"$nulls":3},"AS/NZS 61000.6.4",{"$nulls":48},188,2,0,null,null,"電源高調波_AS_NZS_61000-6-4"]
[{"$nulls":3},"GB17625.1",{"$nulls":48},189,2,0,null,null,"電源高調波_GB17625_1"]
[{"$nulls":3},"GOST R51317.3.2",{"$nulls":48},190,2,0,null,null,"電源高調波_GOST_R51317_3_2"]
[{"$nulls":3},"GOST R51317.3.3",{"$nulls":48},191,2,0,null,null,"電源高調波_GOST_R51317_3_3"]
[{"$nulls":3},"IEC61326-1(製品個別要求条件IEC61326-2シリーズ)*",{"$nulls":48},192,2,0,null,null,"電源高調波_IEC61326-1"]
[{"$nulls":3},"EN61326-1(製品個別要求条件IEC61326-2シリーズ)*",{"$nulls":48},193,2,0,null,null,"電源高調波_EN61326-1"]
[{"$nulls":3},"IEC60601-1-2(製品個別要求条件IEC60601-2シリーズ)*",{"$nulls":48},194,2,0,null,null,"電源高調波_IEC60601-1-2"]
[{"$nulls":3},"EN60601-1-2(製品個別要求条件EN60601-2シリーズ)*",{"$nulls":48},195,2,0,null,null,"電源高調波_EN60601-1-2"]
[{"$nulls":3},"JIS C1806-1",{"$nulls":48},196,2,0,null,null,"電源高調波_JIS_C1806-1"]
[{"$nulls":3},"JIS T0601-1-2(製品個別要求条件JIS T0601-2シリーズ)*",{"$nulls":48},197,2,0,null,null,"電源高調波_JIS_T0601-1-2"]
[null,null,"* 特定の製品規格に限定する場合はご相談ください。",{"$nulls":49},198,2,1]
[null,null,"記載のない試験規格をご希望の場合はここにご記入ください",{"$nulls":49},199,2,2]
[null,null,"注：下記に記載の規格番号及び表記が認定証に記載されます",{"$nulls":49},199,2,1]
[null,null,"日本語規格番号",{"$nulls":10},"通則版",null,"英語規格番号",{"$nulls":10},"通則版",{"$nulls":25},199,2,1]
[{"$nulls":52},199,2,2,{"$f":"IF(C224= \"\",FALSE,TRUE)","v":false},null,{"$f":"IF(C224= \"\",\"\",\"電源高調波_\" & C224)","v":""},{"$f":"IF(C224= \"\",\"\",C224)","v":""},{"$f":"IF(C224= \"\",\"\",IF(P224= \"\",\"\",P224))","v":""},"電源高調波",null,"自動車車載機器"]
[{"$nulls":52},199,2,2,false,null,"","","","電源高調波",null,"自動車車載機器"]
[{"$nulls":52},199,2,2,false,null,"","","","電源高調波",null,"自動車車載機器"]
[{"$nulls":52},199,2,2,false,null,"","","","電源高調波",null,"自動車車載機器"]
[{"$nulls":52},199,2,2,false,null,"","","","電源高調波",null,"自動車車載機器"]
[{"$nulls":52},199,2,2,false,null,"","","","電源高調波",null,"自動車車載機器"]
[{"$nulls":52},199,2,2,false,null,"","","","電源高調波",null,"自動車車載機器"]
[{"$nulls":52},199,2,2,false,null,"","","","電源高調波",null,"自動車車載機器"]
[{"$nulls":52},199,2,2,false,null,"","","","電源高調波",null,"自動車車載機器"]
[{"$nulls":52},199,2,2,false,null,"","","","電源高調波",null,"自動車車載機器"]
[null,null,"行追加",{"$nulls":49},199,2,1]
[null,null,"17．試験規格－自動車・車載機器",{"$nulls":49},200,1,0,null,null,"自動車車載機器"]
[{"$nulls":3},"EU Directive 72/245/EEC",{"$nulls":48},201,2,0,null,null,"自動車車載機器_EU_Directive_72_245_EEC"]
[{"$nulls":3},"EU Directive 2004/104/EC, Annex I, 6.5, 6.6, 6.8, 6.9章",{"$nulls":48},202,2,0,null,null,"自動車車載機器_EU_Directive_2004_104_EC"]
[{"$nulls":3},"ECE R-10, 6.5, 6.6, 6.8, 6.9章",{"$nulls":48},203,2,0,null,null,"自動車車載機器_ECE_R-10"]
[{"$nulls":3},"EN 50498",{"$nulls":48},204,2,0,null,null,"自動車車載機器_EN50498"]
[null,null,"記載のない試験規格をご希望の場合はここにご記入ください",{"$nulls":49},205,2,2]
[null,null,"注：下記に記載の規格番号及び表記が認定証に記載されます",{"$nulls":49},205,2,1]
[null,null,"日本語規格番号",{"$nulls":10},"通則版",null,"英語規格番号",{"$nulls":10},"通則版",{"$nulls":25},205,2,1]
[{"$nulls":52},205,2,2,{"$f":"IF(C243= \"\",FALSE,TRUE)","v":false},null,{"$f":"IF(C243= \"\",\"\",\"自動車車載機器_\" & C243)","v":""},{"$f":"IF(C243= \"\",\"\",C243)","v":""},{"$f":"IF(C243= \"\",\"\",IF(P243= \"\",\"\",P243))","v":""},"自動車車載機器",null,"空気伝搬騒音"]
[{"$nulls":52},205,2,2,false,null,"","","","自動車車載機器",null,"空気伝搬騒音"]
[{"$nulls":52},205,2,2,false,null,"","","","自動車車載機器",null,"空気伝搬騒音"]
[{"$nulls":52},205,2,2,false,null,"","","","自動車車載機器",null,"空気伝搬騒音"]
[{"$nulls":52},205,2,2,false,null,"","","","自動車車載機器",null,"空気伝搬騒音"]
[{"$nulls":52},205,2,2,false,null,"","","","自動車車載機器",null,"空気伝搬騒音"]
[{"$nulls":52},205,2,2,false,null,"","","","自動車車載機器",null,"空気伝搬騒音"]
[{"$nulls":52},205,2,2,false,null,"","","","自動車車載機器",null,"空気伝搬騒音"]
[{"$nulls":52},205,2,2,false,null,"","","","自動車車載機器",null,"空気伝搬騒音"]
[{"$nulls":52},205,2,2,false,null,"","","","自動車車載機器",null,"空気伝搬騒音"]
[null,null,"行追加",{"$nulls":49},205,2,1]
[null,null,"18．試験規格－音響",{"$nulls":49},206,1,0,null,null,"空気伝搬騒音"]
[{"$nulls":3},"ISO 7779",{"$nulls":48},207,2,0,null,null,"空気伝搬騒音_ISO7779"]
[{"$nulls":3},"JIS X7779",{"$nulls":48},208,2,0,null,null,"空気伝搬騒音_JIS_X7779"]
[{"$nulls":3},"EN ISO 7779",{"$nulls":48},209,2,0,null,null,"空気伝搬騒音_EN_ISO7779"]
[{"$nulls":3},"ECMA-74",{"$nulls":48},210,2,0,null,null,"空気伝搬騒音_ECMA-74"]
[{"$nulls":3},"German BlueAngel",{"$nulls":48},211,2,0,null,null,"空気伝搬騒音_ブルーエンジェルマーク"]
[{"$nulls":4},"RAL-UZ 78",{"$nulls":47},212,3,0,null,null,"空気伝搬騒音_ブルーエンジェルマーク_RAL-UZ78"]
[{"$nulls":4},"RAL-UZ 122",{"$nulls":47},213,3,0,null,null,"空気伝搬騒音_ブルーエンジェルマーク_RAL-UZ122"]
[{"$nulls":4},"RAL-UZ 127",{"$nulls":47},214,3,0,null,null,"空気伝搬騒音_ブルーエンジェルマーク_RAL-UZ127"]
[{"$nulls":4},"RAL-UZ 171",{"$nulls":47},215,3,0,null,null,"空気伝搬騒音_ブルーエンジェルマーク_RAL-UZ171"]
[{"$nulls":3},"日本環境協会エコマーク商品類型",{"$nulls":48},216,2,0,null,null,"空気伝搬騒音_日本環境協会エコマーク商品類型"]
[{"$nulls":4},"No.117",{"$nulls":47},217,3,0,null,null,"空気伝搬騒音_日本環境協会エコマーク商品類型_No117"]
[{"$nulls":4},"No.119",{"$nulls":47},218,3,0,null,null,"空気伝搬騒音_日本環境協会エコマーク商品類型_No119"]
[{"$nulls":4},"No.122",{"$nulls":47},219,3,0,null,null,"空気伝搬騒音_日本環境協会エコマーク商品類型_No122"]
[{"$nulls":4},"No.155",{"$nulls":47},220,3,0,null,null,"空気伝搬騒音_日本環境協会エコマーク商品類型_No155"]
[null,null,"記載のない試験規格をご希望の場合はここにご記入ください",{"$nulls":49},221,2,2]
[null,null,"注：下記に記載の規格番号及び表記が認定証に記載されます",{"$nulls":49},221,2,1]
[null,null,"日本語規格番号",{"$nulls":10},"通則版",null,"英語規格番号",{"$nulls":10},"通則版",{"$nulls":25},221,2,1]
[{"$nulls":52},221,2,2,{"$f":"IF(C272= \"\",FALSE,TRUE)","v":false},null,{"$f":"IF(C272= \"\",\"\",\"空気伝搬騒音_\" & C272)","v":""},{"$f":"IF(C272= \"\",\"\",C272)","v":""},{"$f":"IF(C272= \"\",\"\",IF(P272= \"\",\"\",P272))","v":""},"空気伝搬騒音",null,"通信機器性能"]
[{"$nulls":52},221,2,2,false,null,"","","","空気伝搬騒音",null,"通信機器性能"]
[{"$nulls":52},221,2,2,false,null,"","","","空気伝搬騒音",null,"通信機器性能"]
[{"$nulls":52},221,2,2,false,null,"","","","空気伝搬騒音",null,"通信機器性能"]
[{"$nulls":52},221,2,2,false,null,"","","","空気伝搬騒音",null,"通信機器性能"]
[{"$nulls":52},221,2,2,false,null,"","","","空気伝搬騒音",null,"通信機器性能"]
[{"$nulls":52},221,2,2,false,null,"","","","空気伝搬騒音",null,"通信機器性能"]
[{"$nulls":52},221,2,2,false,null,"","","","空気伝搬騒音",null,"通信機器性能"]
[{"$nulls":52},221,2,2,false,null,"","","","空気伝搬騒音",null,"通信機器性能"]
[{"$nulls":52},221,2,2,false,null,"","","","空気伝搬騒音",null,"通信機器性能"]
[null,null,"行追加",{"$nulls":49},221,2,1]
[null,null,"19．試験規格－通信機性能 １",{"$nulls":49},222,1,0,null,null,"通信機器性能"]
[{"$nulls":3},"FCC Part15 Sub.C",{"$nulls":48},223,2,0,null,null,"通信機器性能_FCC_Part15_Sub_C"]
[{"$nulls":3},"FCC Part15 Sub.D ",{"$nulls":48},224,2,0,null,null,"通信機器性能_FCC_Part15_Sub_D"]
[{"$nulls":3},"FCC Part15 Sub.E",{"$nulls":48},225,2,0,null,null,"通信機器性能_FCC_Part15_Sub_E"]
[{"$nulls":3},"FCC Part22 Sub.E",{"$nulls":48},226,2,0,null,null,"通信機器性能_FCC_Part22_Sub_E"]
[{"$nulls":3},"FCC Part22 Sub.H ",{"$nulls":48},227,2,0,null,null,"通信機器性能_FCC_Part22_Sub_H"]
[{"$nulls":3},"FCC Part24 Sub.D ",{"$nulls":48},228,2,0,null,null,"通信機器性能_FCC_Part24_Sub_D"]
[{"$nulls":3},"FCC Part24 Sub.E",{"$nulls":48},229,2,0,null,null,"通信機器性能_FCC_Part24_Sub_E"]
[{"$nulls":3},"FCC Part25",{"$nulls":48},230,2,0,null,null,"通信機器性能_FCC_Part25"]
[{"$nulls":3},"FCC Part27",{"$nulls":48},231,2,0,null,null,"通信機器性能_FCC_Part27"]
[{"$nulls":3},"FCC Part74  ",{"$nulls":48},232,2,0,null,null,"通信機器性能_FCC_Part74"]
[{"$nulls":3},"FCC Part80  ",{"$nulls":48},233,2,0,null,null,"通信機器性能_FCC_Part80"]
[{"$nulls":3},"FCC Part90 ",{"$nulls":48},234,2,0,null,null,"通信機器性能_FCC_Part90"]
[{"$nulls":3},"FCC Part95",{"$nulls":48},235,2,0,null,null,"通信機器性能_FCC_Part95"]
[{"$nulls":3},"FCC Part97",{"$nulls":48},236,2,0,null,null,"通信機器性能_FCC_Part97"]
[{"$nulls":3},"IC RSS-Gen",{"$nulls":48},237,2,0,null,null,"通信機器性能_IC_RSSGen"]
[{"$nulls":3},"IC RSS-210",{"$nulls":48},238,2,0,null,null,"通信機器性能_IC_RSS210"]
[{"$nulls":3},"IC RSS-247",{"$nulls":48},239,2,0,null,null,"通信機器性能_IC_RSS247"]
[{"$nulls":3},"IC RSS-310",{"$nulls":48},240,2,0,null,null,"通信機器性能_IC_RSS310"]
[{"$nulls":3},"IC RSS-118",{"$nulls":48},241,2,0,null,null,"通信機器性能_IC_RSS118"]
[{"$nulls":3},"IC RSS-132",{"$nulls":48},242,2,0,null,null,"通信機器性能_IC_RSS132"]
[{"$nulls":3},"IC RSS-133",{"$nulls":48},243,2,0,null,null,"通信機器性能_IC_RSS133"]
[{"$nulls":3},"IC RSS-119",{"$nulls":48},244,2,0,null,null,"通信機器性能_IC_RSS119"]
[{"$nulls":3},"IC RSS-135",{"$nulls":48},245,2,0,null,null,"通信機器性能_IC_RSS135"]
[{"$nulls":3},"IC RSS-215",{"$nulls":48},246,2,0,null,null,"通信機器性能_IC_RSS215"]
[{"$nulls":3},"EN 300 328 V1.9.1",{"$nulls":48},247,2,0,null,null,"通信機器性能_EN300_328"]
[{"$nulls":3},"EN 301 357-1 ",{"$nulls":48},251,2,0,null,null,"通信機器性能_EN301_357-1"]
[{"$nulls":3},"EN 301 357-2",{"$nulls":48},252,2,0,null,null,"通信機器性能_EN301_357-2"]
[{"$nulls":3},"EN 301 893",{"$nulls":48},253,2,0,null,null,"通信機器性能_EN301_893"]
[{"$nulls":3},"EN 300 086",{"$nulls":48},254,2,0,null,null,"通信機器性能_EN300_086"]
[{"$nulls":3},"EN 300 086-1",{"$nulls":48},255,2,0,null,null,"通信機器性能_EN300_086-1"]
[{"$nulls":3},"EN 300 086-2",{"$nulls":48},256,2,0,null,null,"通信機器性能_EN300_086-2"]
[{"$nulls":3},"EN 300 219",{"$nulls":48},257,2,0,null,null,"通信機器性能_EN300_219"]
[{"$nulls":3},"EN 300 219-1",{"$nulls":48},258,2,0,null,null,"通信機器性能_EN300_219-1"]
[{"$nulls":3},"EN 300 219-2",{"$nulls":48},259,2,0,null,null,"通信機器性能_EN300_219-2"]
[{"$nulls":3},"EN 300 113",{"$nulls":48},260,2,0,null,null,"通信機器性能_EN300_113"]
[{"$nulls":3},"EN 300 113-1",{"$nulls":48},261,2,0,null,null,"通信機器性能_EN300_113-1"]
[{"$nulls":3},"EN 300 113-2",{"$nulls":48},262,2,0,null,null,"通信機器性能_EN300_113-2"]
[{"$nulls":3},"EN 301 166",{"$nulls":48},263,2,0,null,null,"通信機器性能_EN301_166"]
[{"$nulls":3},"EN 301 166-1",{"$nulls":48},264,2,0,null,null,"通信機器性能_EN301_166-1"]
[{"$nulls":3},"EN 301 166-2",{"$nulls":48},265,2,0,null,null,"通信機器性能_EN301_166-2"]
[{"$nulls":3},"EN 301 489-1",{"$nulls":48},266,2,0,null,null,"通信機器性能_EN301_489-1"]
[{"$nulls":3},"EN 301 489-",{"$nulls":48},267,2,0,null,"J-7","通信機器性能_EN301_489_SUB",{"$nulls":3},{"$f":"J325&\",\"&M325&\",\"&P325&\",\"&S325&\",\"&V325&\",\"&Y325&\",\"&AB325","v":",,,,,,"}]
[{"$nulls":3},"EN 301 511",{"$nulls":48},268,2,0,null,null,"通信機器性能_EN301_511"]
[{"$nulls":3},"EN 301 908-1",{"$nulls":48},269,2,0,null,null,"通信機器性能_EN301_908-1"]
[{"$nulls":3},"EN 302 291-1",{"$nulls":48},270,2,0,null,null,"通信機器性能_EN302_291-1"]
[{"$nulls":3},"EN 302 291-2",{"$nulls":48},271,2,0,null,null,"通信機器性能_EN302_291-2"]
[{"$nulls":3},"EN 300 220",{"$nulls":48},272,2,0,null,null,"通信機器性能_EN300_220"]
[{"$nulls":3},"EN 300 220-1",{"$nulls":48},273,2,0,null,null,"通信機器性能_EN300_220-1"]
[{"$nulls":3},"EN 300 220-2",{"$nulls":48},274,2,0,null,null,"通信機器性能_EN300_220-2"]
[{"$nulls":3},"EN 300 330",{"$nulls":48},275,2,0,null,null,"通信機器性能_EN300_330"]
[{"$nulls":3},"EN 300 330-1",{"$nulls":48},276,2,0,null,null,"通信機器性能_EN300_330-1"]
[{"$nulls":3},"EN 300 330-2",{"$nulls":48},277,2,0,null,null,"通信機器性能_EN300_330-2"]
[{"$nulls":3},"EN 300 440",{"$nulls":48},278,2,0,null,null,"通信機器性能_EN300_440"]
[{"$nulls":3},"EN 300 440-1",{"$nulls":48},279,2,0,null,null,"通信機器性能_EN300_440-1"]
[{"$nulls":3},"EN 300 440-2",{"$nulls":48},280,2,0,null,null,"通信機器性能_EN300_440-2"]
[{"$nulls":3},"EN 300 422",{"$nulls":48},281,2,0,null,null,"通信機器性能_EN300_422"]
[{"$nulls":3},"EN 300 422-1",{"$nulls":48},282,2,0,null,null,"通信機器性能_EN300_422-1"]
[{"$nulls":3},"EN 300 422-2",{"$nulls":48},283,2,0,null,null,"通信機器性能_EN300_422-2"]
[null,null,"記載のない試験規格をご希望の場合はここにご記入ください",{"$nulls":49},284,2,2]
[null,null,"注：下記に記載の規格番号及び表記が認定証に記載されます",{"$nulls":49},284,2,1]
[null,null,"日本語規格番号",{"$nulls":10},"通則版",null,"英語規格番号",{"$nulls":10},"通則版",{"$nulls":25},284,2,1]
[{"$nulls":52},284,2,2,{"$f":"IF(C345= \"\",FALSE,TRUE)","v":false},null,{"$f":"IF(C345= \"\",\"\",\"通信機器性能_\" & C345)","v":""},{"$f":"IF(C345= \"\",\"\",C345)","v":""},{"$f":"IF(C345= \"\",\"\",IF(P345= \"\",\"\",P345))","v":""},"通信機器性能",null,"通信機器性能2"]
[{"$nulls":52},284,2,2,false,null,"","","","通信機器性能",null,"通信機器性能2"]
[{"$nulls":52},284,2,2,false,null,"","","","通信機器性能",null,"通信機器性能2"]
[{"$nulls":52},284,2,2,false,null,"","","","通信機器性能",null,"通信機器性能2"]
[{"$nulls":52},284,2,2,false,null,"","","","通信機器性能",null,"通信機器性能2"]
[{"$nulls":52},284,2,2,false,null,"","","","通信機器性能",null,"通信機器性能2"]
[{"$nulls":52},284,2,2,false,null,"","","","通信機器性能",null,"通信機器性能2"]
[{"$nulls":52},284,2,2,false,null,"","","","通信機器性能",null,"通信機器性能2"]
[{"$nulls":52},284,2,2,false,null,"","","","通信機器性能",null,"通信機器性能2"]
[{"$nulls":52},284,2,2,false,null,"","","","通信機器性能",null,"通信機器性能2"]
[null,null,"行追加",{"$nulls":49},284,2,1]
[null,null,"20．試験規格－通信機性能 ２",{"$nulls":49},285,1,0,null,null,"通信機器性能2"]
[{"$nulls":3},"IEC 62209 Part 1",{"$nulls":48},286,2,0,null,null,"通信機器性能2_IEC62209_Part1"]
[{"$nulls":3},"IEC 62209 Part 2 ",{"$nulls":48},287,2,0,null,null,"通信機器性能2_IEC62209_Part2"]
[{"$nulls":3},"EN 62209-1",{"$nulls":48},288,2,0,null,null,"通信機器性能2_EN62209-1"]
[{"$nulls":3},"EN 62209-2",{"$nulls":48},289,2,0,null,null,"通信機器性能2_EN62209-2"]
[{"$nulls":3},"EN 50383",{"$nulls":48},290,2,0,null,null,"通信機器性能2_EN50383"]
[{"$nulls":3},"FCC OET65/Supplement C",{"$nulls":48},291,2,0,null,null,"通信機器性能2_FCC_OET65_SupplementC"]
[{"$nulls":3},"FCC ANSI/IEEE1528",{"$nulls":48},292,2,0,null,null,"通信機器性能2_FCC_ANSI_ＩEEE1528"]
[{"$nulls":3},"IC RSS102",{"$nulls":48},293,2,0,null,null,"通信機器性能2_IC_RSS102"]
[{"$nulls":3},"IEC 62311",{"$nulls":48},294,2,0,null,null,"通信機器性能2_IEC62311"]
[{"$nulls":3},"EN 62311",{"$nulls":48},295,2,0,null,null,"通信機器性能2_EN62311"]
[{"$nulls":3},"EN 62369-1",{"$nulls":48},296,2,0,null,null,"通信機器性能2_EN62369-1"]
[{"$nulls":3},"IEC 62369-1",{"$nulls":48},297,2,0,null,null,"通信機器性能2_IEC62369-1"]
[{"$nulls":3},"EN 50371",{"$nulls":48},298,2,0,null,null,"通信機器性能2_EN50371"]
[{"$nulls":3},"IEC 62479",{"$nulls":48},299,2,0,null,null,"通信機器性能2_IEC62479"]
[{"$nulls":3},"EN 62479",{"$nulls":48},300,2,0,null,null,"通信機器性能2_EN62479"]
[{"$nulls":3},"EN 50385",{"$nulls":48},301,2,0,null,null,"通信機器性能2_EN50385"]
[{"$nulls":3},"EN 50566",{"$nulls":48},302,2,0,null,null,"通信機器性能2_EN50566"]
[{"$nulls":3},"EN 50364",{"$nulls":48},303,2,0,null,null,"通信機器性能2_EN50364"]
[{"$nulls":3},"IEC 62233",{"$nulls":48},304,2,0,null,null,"通信機器性能2_IEC62233"]
[{"$nulls":3},"EN 62233",{"$nulls":48},305,2,0,null,null,"通信機器性能2_EN62233"]
[{"$nulls":3},"EN 50360",{"$nulls":48},306,2,0,null,null,"通信機器性能2_EN50360"]
[{"$nulls":3},"EN 50361",{"$nulls":48},307,2,0,null,null,"通信機器性能2_EN50361"]
[{"$nulls":3},"EN 50366",{"$nulls":48},308,2,0,null,null,"通信機器性能2_EN50366"]
[{"$nulls":3},"総務省令無線設備規則（局所比吸収率）",{"$nulls":48},309,2,0,null,null,"通信機器性能2_総務省令無線設備規則_局所比吸収率"]
[{"$nulls":3},"ARIB STD-T56　",{"$nulls":48},310,2,0,null,null,"通信機器性能2_ARIB_STD-T56"]
[null,null,"記載のない試験規格をご希望の場合はここにご記入ください",{"$nulls":49},311,2,2]
[null,null,"注：下記に記載の規格番号及び表記が認定証に記載されます",{"$nulls":49},311,2,1]
[null,null,"日本語規格番号",{"$nulls":10},"通則版",null,"英語規格番号",{"$nulls":10},"通則版",{"$nulls":25},311,2,1]
[{"$nulls":52},311,2,2,{"$f":"IF(C385= \"\",FALSE,TRUE)","v":false},null,{"$f":"IF(C385= \"\",\"\",\"通信機器性能2_\" & C385)","v":""},{"$f":"IF(C385= \"\",\"\",C385)","v":""},{"$f":"IF(C385= \"\",\"\",IF(P385= \"\",\"\",P385))","v":""},"通信機器性能2",null,"通信機器性能3"]
[{"$nulls":52},311,2,2,false,null,"","","","通信機器性能2",null,"通信機器性能3"]
[{"$nulls":52},311,2,2,false,null,"","","","通信機器性能2",null,"通信機器性能3"]
[{"$nulls":52},311,2,2,false,null,"","","","通信機器性能2",null,"通信機器性能3"]
[{"$nulls":52},311,2,2,false,null,"","","","通信機器性能2",null,"通信機器性能3"]
[{"$nulls":52},311,2,2,false,null,"","","","通信機器性能2",null,"通信機器性能3"]
[{"$nulls":52},311,2,2,false,null,"","","","通信機器性能2",null,"通信機器性能3"]
[{"$nulls":52},311,2,2,false,null,"","","","通信機器性能2",null,"通信機器性能3"]
[{"$nulls":52},311,2,2,false,null,"","","","通信機器性能2",null,"通信機器性能3"]
[{"$nulls":52},311,2,2,false,null,"","","","通信機器性能2",null,"通信機器性能3"]
[null,null,"行追加",{"$nulls":49},311,2,1]
[null,null,"21．試験規格－通信機性能 ３",{"$nulls":49},312,1,0,null,null,"通信機器性能3"]
[{"$nulls":3},"FCC Part68",{"$nulls":48},313,2,0,null,null,"通信機器性能3_FCC_Part68"]
[{"$nulls":3},"ANSI/TIA-968-B, B-1",{"$nulls":48},314,2,0,null,null,"通信機器性能3_ANSI/TIA-968-B,B-1"]
[{"$nulls":3},"IC CS-03",{"$nulls":48},315,2,0,null,null,"通信機器性能3_IC_CS-03"]
[null,null,"記載のない試験規格をご希望の場合はここにご記入ください",{"$nulls":49},316,2,2]
[null,null,"注：下記に記載の規格番号及び表記が認定証に記載されます",{"$nulls":49},316,2,1]
[null,null,"日本語規格番号",{"$nulls":10},"通則版",null,"英語規格番号",{"$nulls":10},"通則版",{"$nulls":25},316,2,1]
[{"$nulls":52},316,2,2,{"$f":"IF(C403= \"\",FALSE,TRUE)","v":false},null,{"$f":"IF(C403= \"\",\"\",\"通信機器性能3_\" & C403)","v":""},{"$f":"IF(C403= \"\",\"\",C403)","v":""},{"$f":"IF(C403= \"\",\"\",IF(P403= \"\",\"\",P403))","v":""},"通信機器性能3",null,"環境"]
[{"$nulls":52},316,2,2,false,null,"","","","通信機器性能3",null,"環境"]
[{"$nulls":52},316,2,2,false,null,"","","","通信機器性能3",null,"環境"]
[{"$nulls":52},316,2,2,false,null,"","","","通信機器性能3",null,"環境"]
[{"$nulls":52},316,2,2,false,null,"","","","通信機器性能3",null,"環境"]
[{"$nulls":52},316,2,2,false,null,"","","","通信機器性能3",null,"環境"]
[{"$nulls":52},316,2,2,false,null,"","","","通信機器性能3",null,"環境"]
[{"$nulls":52},316,2,2,false,null,"","","","通信機器性能3",null,"環境"]
[{"$nulls":52},316,2,2,false,null,"","","","通信機器性能3",null,"環境"]
[{"$nulls":52},316,2,2,false,null,"","","","通信機器性能3",null,"環境"]
[null,null,"行追加",{"$nulls":49},316,2,1]
[null,null,"22．試験規格－環境（消費電力）（注：本項を申請する場合は、事前にVLACにご相談ください。）",{"$nulls":49},317,1,0,null,null,"環境"]
[{"$nulls":3},"国際エネルギースタープログラム運用細則",{"$nulls":48},318,2,0,null,null,"環境_国際"]
[{"$nulls":4},"コンピュータ類",{"$nulls":47},319,3,0,null,null,"環境_国際_コンピュータ"]
[{"$nulls":5},"デスクトップ",{"$nulls":46},320,4,0,null,null,"環境_国際_コンピュータ_デスクトップ"]
[{"$nulls":5},"ノートブック",{"$nulls":46},321,4,0,null,null,"環境_国際_コンピュータ_ノートブック"]
[{"$nulls":5},"一体型デスクトップ",{"$nulls":46},322,4,0,null,null,"環境_国際_コンピュータ_一体型デスクトップ"]
[{"$nulls":5},"ワークステーション",{"$nulls":46},323,4,0,null,null,"環境_国際_コンピュータ_ワークステーション"]
[{"$nulls":5},"小型サーバー",{"$nulls":46},324,4,0,null,null,"環境_国際_コンピュータ_小型サーバー"]
[{"$nulls":5},"シンクライアント",{"$nulls":46},325,4,0,null,null,"環境_国際_コンピュータ_シンクライアント"]
[{"$nulls":4},"ディスプレイ類",{"$nulls":47},326,3,0,null,null,"環境_国際_ディスプレイ"]
[{"$nulls":5},"CRTディスプレイ",{"$nulls":46},327,4,0,null,null,"環境_国際_ディスプレイ_CRTディスプレイ"]
[{"$nulls":5},"30インチ未満",{"$nulls":46},328,4,0,null,null,"環境_国際_ディスプレイ_30インチ未満"]
[{"$nulls":5},"30インチ以上",{"$nulls":46},329,4,0,null,null,"環境_国際_ディスプレイ_30インチ以上"]
[{"$nulls":5},"固定画素ディスプレイ",{"$nulls":46},330,4,0,null,null,"環境_国際_ディスプレイ_固定画素ディスプレイ"]
[{"$nulls":4},"画像機器類",{"$nulls":47},331,3,0,null,null,"環境_国際_画像機器"]
[{"$nulls":5},"プリンタ",{"$nulls":46},332,4,0,null,null,"環境_国際_画像機器_プリンタ"]
[{"$nulls":5},"複写機",{"$nulls":46},333,4,0,null,null,"環境_国際_画像機器_複写機"]
[{"$nulls":5},"ファクシミリ",{"$nulls":46},334,4,0,null,null,"環境_国際_画像機器_ファクシミリ"]
[{"$nulls":5},"スキャナ",{"$nulls":46},335,4,0,null,null,"環境_国際_画像機器_スキャナ"]
[{"$nulls":5},"複合機",{"$nulls":46},336,4,0,null,null,"環境_国際_画像機器_複合機"]
[{"$nulls":5},"ディジタル印刷機",{"$nulls":46},337,4,0,null,null,"環境_国際_画像機器_ディジタル印刷機"]
[{"$nulls":3},"米国エネルギースタープログラム",{"$nulls":48},338,2,0,null,null,"環境_米国"]
[{"$nulls":4},"コンピュータ類",{"$nulls":47},339,3,0,null,null,"環境_米国_コンピュータ"]
[{"$nulls":5},"デスクトップ",{"$nulls":46},340,4,0,null,null,"環境_米国_コンピュータ_デスクトップ"]
[{"$nulls":5},"ノートブック",{"$nulls":46},341,4,0,null,null,"環境_米国_コンピュータ_ノートブック"]
[{"$nulls":5},"一体型デスクトップ",{"$nulls":46},342,4,0,null,null,"環境_米国_コンピュータ_一体型デスクトップ"]
[{"$nulls":5},"ワークステーション",{"$nulls":46},343,4,0,null,null,"環境_米国_コンピュータ_ワークステーション"]
[{"$nulls":5},"小型サーバー",{"$nulls":46},344,4,0,null,null,"環境_米国_コンピュータ_小型サーバー"]
[{"$nulls":5},"シンクライアント",{"$nulls":46},345,4,0,null,null,"環境_米国_コンピュータ_シンクライアント"]
[{"$nulls":4},"ディスプレイ類",{"$nulls":47},346,3,0,null,null,"環境_米国_ディスプレイ"]
[{"$nulls":5},"CRTディスプレイ",{"$nulls":46},347,4,0,null,null,"環境_米国_ディスプレイ_CRTディスプレイ"]
[{"$nulls":5},"30インチ未満",{"$nulls":46},348,4,0,null,null,"環境_米国_ディスプレイ_30インチ未満"]
[{"$nulls":5},"30インチ以上",{"$nulls":46},349,4,0,null,null,"環境_米国_ディスプレイ_30インチ以上"]
[{"$nulls":5},"固定画素ディスプレイ",{"$nulls":46},350,4,0,null,null,"環境_米国_ディスプレイ_固定画素ディスプレイ"]
[{"$nulls":4},"画像機器類",{"$nulls":47},351,3,0,null,null,"環境_米国_画像機器"]
[{"$nulls":5},"プリンタ",{"$nulls":46},352,4,0,null,null,"環境_米国_画像機器_プリンタ"]
[{"$nulls":5},"複写機",{"$nulls":46},353,4,0,null,null,"環境_米国_画像機器_複写機"]
[{"$nulls":5},"ファクシミリ",{"$nulls":46},354,4,0,null,null,"環境_米国_画像機器_ファクシミリ"]
[{"$nulls":5},"スキャナ",{"$nulls":46},355,4,0,null,null,"環境_米国_画像機器_スキャナ"]
[{"$nulls":5},"複合機",{"$nulls":46},356,4,0,null,null,"環境_米国_画像機器_複合機"]
[{"$nulls":5},"ディジタル印刷機",{"$nulls":46},357,4,0,null,null,"環境_米国_画像機器_ディジタル印刷機"]
[{"$nulls":5},"郵便機器",{"$nulls":46},358,4,0,null,null,"環境_米国_画像機器_郵便機器"]
[{"$nulls":4},"テレビジョン受信機",{"$nulls":47},359,3,0,null,null,"環境_米国_テレビジョン受信機"]
[{"$nulls":4},"コンピューターサーバー",{"$nulls":47},360,3,0,null,null,"環境_米国_コンピューターサーバー"]
[{"$nulls":4},"電話機器",{"$nulls":47},361,3,0,null,null,"環境_米国_電話機器"]
[{"$nulls":3},"エネルギーラベル",{"$nulls":48},362,2,0,null,null,"環境_エネルギーラベル"]
[{"$nulls":4},"家庭用冷蔵庫/冷凍庫",{"$nulls":47},363,3,0,null,null,"環境_エネルギーラベル_家庭用冷蔵庫/冷凍庫"]
[{"$nulls":5},"IEC62552",{"$nulls":46},364,4,0,null,null,"環境_エネルギーラベル_家庭用冷蔵庫/冷凍庫_IEC62552"]
[{"$nulls":5},"JIS C 9801",{"$nulls":46},365,4,0,null,null,"環境_エネルギーラベル_家庭用冷蔵庫/冷凍庫_JIS_C_9801"]
[{"$nulls":5},"JIS B 8630",{"$nulls":46},366,4,0,null,null,"環境_エネルギーラベル_家庭用冷蔵庫/冷凍庫_JIS_B_8630"]
[{"$nulls":3},"記載のない試験規格をご希望の場合はここにご記入ください",{"$nulls":48},367,3,2]
[{"$nulls":3},"注：下記に記載の規格番号及び表記が認定証に記載されます",{"$nulls":48},367,3,1]
[{"$nulls":3},"日本語規格番号",{"$nulls":10},"通則版",null,"英語規格番号",{"$nulls":10},"通則版",{"$nulls":24},367,3,1]
[{"$nulls":52},367,3,2,{"$f":"IF(D467= \"\",FALSE,TRUE)","v":false},null,{"$f":"IF(D467= \"\",\"\",\"環境_\" & D467)","v":""},{"$f":"IF(D467= \"\",\"\",D467)","v":""},{"$f":"IF(D467= \"\",\"\",IF(Q467= \"\",\"\",Q467))","v":""},"環境",null,"製品安全試験"]
[{"$nulls":52},367,3,2,false,null,"","","","環境",null,"製品安全試験"]
[{"$nulls":52},367,3,2,false,null,"","","","環境",null,"製品安全試験"]
[{"$nulls":52},367,3,2,false,null,"","","","環境",null,"製品安全試験"]
[{"$nulls":52},367,3,2,false,null,"","","","環境",null,"製品安全試験"]
[{"$nulls":52},367,3,2,false,null,"","","","環境",null,"製品安全試験"]
[{"$nulls":52},367,3,2,false,null,"","","","環境",null,"製品安全試験"]
[{"$nulls":52},367,3,2,false,null,"","","","環境",null,"製品安全試験"]
[{"$nulls":52},367,3,2,false,null,"","","","環境",null,"製品安全試験"]
[{"$nulls":52},367,3,2,false,null,"","","","環境",null,"製品安全試験"]
[{"$nulls":3},"行追加",{"$nulls":48},367,3,1]
[null,null,"23．試験規格－製品安全（注：本項を申請する場合は、事前にVLACにご相談ください。）",{"$nulls":49},368,1,0,null,null,"製品安全試験"]
[{"$nulls":3},"家電製品",{"$nulls":48},370,2,0,null,null,"製品安全試験_IEC_家電製品"]
[{"$nulls":4},"IEC60335-1シリーズ",{"$nulls":47},371,3,0,null,null,"製品安全試験_IEC_家電製品_IEC60335-1"]
[{"$nulls":4},"IEC60335-2シリーズ",{"$nulls":47},372,3,0,null,null,"製品安全試験_IEC_家電製品_IEC60335-2"]
[{"$nulls":4},"EN 60335-1シリーズ",{"$nulls":47},373,3,0,null,null,"製品安全試験_IEC_家電製品_EN60335-1"]
[{"$nulls":4},"EN 60335-2シリーズ",{"$nulls":47},374,3,0,null,null,"製品安全試験_IEC_家電製品_EN60335-2"]
[{"$nulls":4},"JIS C 90335-1シリーズ",{"$nulls":47},375,3,0,null,null,"製品安全試験_IEC_家電製品_JIS_C_90335-1"]
[{"$nulls":4},"JIS C 90335-2シリーズ",{"$nulls":47},376,3,0,null,null,"製品安全試験_IEC_家電製品_JIS_C_90335-2"]
[{"$nulls":3},"記載のない試験規格をご希望の場合はここにご記入ください",{"$nulls":48},377,3,3]
[{"$nulls":3},"注：下記に記載の規格番号及び表記が認定証に記載されます",{"$nulls":48},377,3,1]
[{"$nulls":3},"日本語規格番号",{"$nulls":10},"通則版",null,"英語規格番号",{"$nulls":10},"通則版",{"$nulls":24},377,3,1]
[{"$nulls":52},377,3,3,{"$f":"IF(D489= \"\",FALSE,TRUE)","v":false},null,{"$f":"IF(D489= \"\",\"\",\"製品安全試験_IEC_家電製品_\" & D489)","v":""},{"$f":"IF(D489= \"\",\"\",D489)","v":""},{"$f":"IF(D489= \"\",\"\",IF(Q489= \"\",\"\",Q489))","v":""},"製品安全試験_IEC_家電製品",null,"製品安全試験_IEC_IT機器"]
[{"$nulls":52},377,3,3,false,null,"","","","製品安全試験_IEC_家電製品",null,"製品安全試験_IEC_IT機器"]
[{"$nulls":52},377,3,3,false,null,"","","","製品安全試験_IEC_家電製品",null,"製品安全試験_IEC_IT機器"]
[{"$nulls":52},377,3,3,false,null,"","","","製品安全試験_IEC_家電製品",null,"製品安全試験_IEC_IT機器"]
[{"$nulls":52},377,3,3,false,null,"","","","製品安全試験_IEC_家電製品",null,"製品安全試験_IEC_IT機器"]
[{"$nulls":52},377,3,3,false,null,"","","","製品安全試験_IEC_家電製品",null,"製品安全試験_IEC_IT機器"]
[{"$nulls":52},377,3,3,false,null,"","","","製品安全試験_IEC_家電製品",null,"製品安全試験_IEC_IT機器"]
[{"$nulls":52},377,3,3,false,null,"","","","製品安全試験_IEC_家電製品",null,"製品安全試験_IEC_IT機器"]
[{"$nulls":52},377,3,3,false,null,"","","","製品安全試験_IEC_家電製品",null,"製品安全試験_IEC_IT機器"]
[{"$nulls":52},377,3,3,false,null,"","","","製品安全試験_IEC_家電製品",null,"製品安全試験_IEC_IT機器"]
[{"$nulls":3},"行追加",{"$nulls":48},377,3,1]
[{"$nulls":3},"IT機器",{"$nulls":48},378,2,0,null,null,"製品安全試験_IEC_IT機器"]
[{"$nulls":4},"IEC 60950-1",{"$nulls":47},379,3,0,null,null,"製品安全試験_IEC_IT機器_IEC60950-1"]
[{"$nulls":4},"EN 60950-1",{"$nulls":47},380,3,0,null,null,"製品安全試験_IEC_IT機器_EN60950-1"]
[{"$nulls":4},"JIS C60950-1",{"$nulls":47},381,3,0,null,null,"製品安全試験_IEC_IT機器_JIS_C_60950-1"]
[{"$nulls":3},"記載のない試験規格をご希望の場合はここにご記入ください",{"$nulls":48},382,3,3]
[{"$nulls":3},"注：下記に記載の規格番号及び表記が認定証に記載されます",{"$nulls":48},382,3,1]
[{"$nulls":3},"日本語規格番号",{"$nulls":10},"通則版",null,"英語規格番号",{"$nulls":10},"通則版",{"$nulls":24},382,3,1]
[{"$nulls":52},382,3,3,{"$f":"IF(D507= \"\",FALSE,TRUE)","v":false},null,{"$f":"IF(D507= \"\",\"\",\"製品安全試験_IEC_IT機器_\" & D507)","v":""},{"$f":"IF(D507= \"\",\"\",D507)","v":""},{"$f":"IF(D507= \"\",\"\",IF(Q507= \"\",\"\",Q507))","v":""},"製品安全試験_IEC_IT機器",null,"製品安全試験_IEC_AV機器"]
[{"$nulls":52},382,3,3,false,null,"","","","製品安全試験_IEC_IT機器",null,"製品安全試験_IEC_AV機器"]
[{"$nulls":52},382,3,3,false,null,"","","","製品安全試験_IEC_IT機器",null,"製品安全試験_IEC_AV機器"]
[{"$nulls":52},382,3,3,false,null,"","","","製品安全試験_IEC_IT機器",null,"製品安全試験_IEC_AV機器"]
[{"$nulls":52},382,3,3,false,null,"","","","製品安全試験_IEC_IT機器",null,"製品安全試験_IEC_AV機器"]
[{"$nulls":52},382,3,3,false,null,"","","","製品安全試験_IEC_IT機器",null,"製品安全試験_IEC_AV機器"]
[{"$nulls":52},382,3,3,false,null,"","","","製品安全試験_IEC_IT機器",null,"製品安全試験_IEC_AV機器"]
[{"$nulls":52},382,3,3,false,null,"","","","製品安全試験_IEC_IT機器",null,"製品安全試験_IEC_AV機器"]
[{"$nulls":52},382,3,3,false,null,"","","","製品安全試験_IEC_IT機器",null,"製品安全試験_IEC_AV機器"]
[{"$nulls":52},382,3,3,false,null,"","","","製品安全試験_IEC_IT機器",null,"製品安全試験_IEC_AV機器"]
[{"$nulls":3},"行追加",{"$nulls":48},382,3,1]
[{"$nulls":3},"AV機器",{"$nulls":48},383,2,0,null,null,"製品安全試験_IEC_AV機器"]
[{"$nulls":4},"IEC 60065",{"$nulls":47},384,3,0,null,null,"製品安全試験_IEC_AV機器_IEC60065"]
[{"$nulls":4},"EN 60065",{"$nulls":47},385,3,0,null,null,"製品安全試験_IEC_AV機器_EN60065"]
[{"$nulls":4},"JIS C6065",{"$nulls":47},386,3,0,null,null,"製品安全試験_IEC_AV機器_JIS_C_6065"]
[{"$nulls":3},"記載のない試験規格をご希望の場合はここにご記入ください",{"$nulls":48},387,3,3]
[{"$nulls":3},"注：下記に記載の規格番号及び表記が認定証に記載されます",{"$nulls":48},387,3,1]
[{"$nulls":3},"日本語規格番号",{"$nulls":10},"通則版",null,"英語規格番号",{"$nulls":10},"通則版",{"$nulls":24},387,3,1]
[{"$nulls":52},387,3,3,{"$f":"IF(D525= \"\",FALSE,TRUE)","v":false},null,{"$f":"IF(D525= \"\",\"\",\"製品安全試験_IEC_AV機器_\" & D525)","v":""},{"$f":"IF(D525= \"\",\"\",D525)","v":""},{"$f":"IF(D525= \"\",\"\",IF(Q525= \"\",\"\",Q525))","v":""},"製品安全試験_IEC_AV機器",null,"製品安全試験_IEC_医用電気機器"]
[{"$nulls":52},387,3,3,false,null,"","","","製品安全試験_IEC_AV機器",null,"製品安全試験_IEC_医用電気機器"]
[{"$nulls":52},387,3,3,false,null,"","","","製品安全試験_IEC_AV機器",null,"製品安全試験_IEC_医用電気機器"]
[{"$nulls":52},387,3,3,false,null,"","","","製品安全試験_IEC_AV機器",null,"製品安全試験_IEC_医用電気機器"]
[{"$nulls":52},387,3,3,false,null,"","","","製品安全試験_IEC_AV機器",null,"製品安全試験_IEC_医用電気機器"]
[{"$nulls":52},387,3,3,false,null,"","","","製品安全試験_IEC_AV機器",null,"製品安全試験_IEC_医用電気機器"]
[{"$nulls":52},387,3,3,false,null,"","","","製品安全試験_IEC_AV機器",null,"製品安全試験_IEC_医用電気機器"]
[{"$nulls":52},387,3,3,false,null,"","","","製品安全試験_IEC_AV機器",null,"製品安全試験_IEC_医用電気機器"]
[{"$nulls":52},387,3,3,false,null,"","","","製品安全試験_IEC_AV機器",null,"製品安全試験_IEC_医用電気機器"]
[{"$nulls":52},387,3,3,false,null,"","","","製品安全試験_IEC_AV機器",null,"製品安全試験_IEC_医用電気機器"]
[{"$nulls":3},"行追加",{"$nulls":48},387,3,1]
[{"$nulls":3},"医用電気機器",{"$nulls":48},388,2,0,null,null,"製品安全試験_IEC_医用電気機器"]
[{"$nulls":4},"IEC 60601-1シリーズ",{"$nulls":47},390,3,0,null,null,"製品安全試験_IEC_医用電気機器_IEC60601-1"]
[{"$nulls":4},"IEC 60601-2シリーズ",{"$nulls":47},391,3,0,null,null,"製品安全試験_IEC_医用電気機器_IEC60601-2"]
[{"$nulls":4},"EN 60601-1シリーズ",{"$nulls":47},393,3,0,null,null,"製品安全試験_IEC_医用電気機器_EN60601-1"]
[{"$nulls":4},"EN 60601-2シリーズ",{"$nulls":47},394,3,0,null,null,"製品安全試験_IEC_医用電気機器_EN60601-2"]
[{"$nulls":4},"JIS T0601-1シリーズ",{"$nulls":47},395,3,0,null,null,"製品安全試験_IEC_医用電気機器_JIS_T0601-1"]
[{"$nulls":4},"JIS T0601-2シリーズ",{"$nulls":47},397,3,0,null,null,"製品安全試験_IEC_医用電気機器_JIS_T0601-2"]
[{"$nulls":3},"記載のない試験規格をご希望の場合はここにご記入ください",{"$nulls":48},398,3,3]
[{"$nulls":3},"注：下記に記載の規格番号及び表記が認定証に記載されます",{"$nulls":48},398,3,1]
[{"$nulls":3},"日本語規格番号",{"$nulls":10},"通則版",null,"英語規格番号",{"$nulls":10},"通則版",{"$nulls":24},398,3,1]
[{"$nulls":52},398,3,3,{"$f":"IF(D546= \"\",FALSE,TRUE)","v":false},null,{"$f":"IF(D546= \"\",\"\",\"製品安全試験_IEC_医用電気機器_\" & D546)","v":""},{"$f":"IF(D546= \"\",\"\",D546)","v":""},{"$f":"IF(D546= \"\",\"\",IF(Q546= \"\",\"\",Q546))","v":""},"製品安全試験_IEC_医用電気機器",null,"製品安全試験_IEC_制御機器計測機器"]
[{"$nulls":52},398,3,3,false,null,"","","","製品安全試験_IEC_医用電気機器",null,"製品安全試験_IEC_制御機器計測機器"]
[{"$nulls":52},398,3,3,false,null,"","","","製品安全試験_IEC_医用電気機器",null,"製品安全試験_IEC_制御機器計測機器"]
[{"$nulls":52},398,3,3,false,null,"","","","製品安全試験_IEC_医用電気機器",null,"製品安全試験_IEC_制御機器計測機器"]
[{"$nulls":52},398,3,3,false,null,"","","","製品安全試験_IEC_医用電気機器",null,"製品安全試験_IEC_制御機器計測機器"]
[{"$nulls":52},398,3,3,false,null,"","","","製品安全試験_IEC_医用電気機器",null,"製品安全試験_IEC_制御機器計測機器"]
[{"$nulls":52},398,3,3,false,null,"","","","製品安全試験_IEC_医用電気機器",null,"製品安全試験_IEC_制御機器計測機器"]
[{"$nulls":52},398,3,3,false,null,"","","","製品安全試験_IEC_医用電気機器",null,"製品安全試験_IEC_制御機器計測機器"]
[{"$nulls":52},398,3,3,false,null,"","","","製品安全試験_IEC_医用電気機器",null,"製品安全試験_IEC_制御機器計測機器"]
[{"$nulls":52},398,3,3,false,null,"","","","製品安全試験_IEC_医用電気機器",null,"製品安全試験_IEC_制御機器計測機器"]
[{"$nulls":3},"行追加",{"$nulls":48},398,3,1]
[{"$nulls":3},"制御機器・計測機器",{"$nulls":48},399,2,0,null,null,"製品安全試験_IEC_制御機器計測機器"]
[{"$nulls":4},"IEC 61010-1シリーズ",{"$nulls":47},400,3,0,null,null,"製品安全試験_IEC_制御機器計測機器_IEC61010-1"]
[{"$nulls":4},"IEC 61010-2シリーズ",{"$nulls":47},401,3,0,null,null,"製品安全試験_IEC_制御機器計測機器_IEC61010-2"]
[{"$nulls":4},"EN 61010-1シリーズ",{"$nulls":47},402,3,0,null,null,"製品安全試験_IEC_制御機器計測機器_EN61010-1"]
[{"$nulls":4},"EN 61010-2シリーズ",{"$nulls":47},403,3,0,null,null,"製品安全試験_IEC_制御機器計測機器_EN61010-2"]
[{"$nulls":4},"JIS C1010-1シリーズ",{"$nulls":47},404,3,0,null,null,"製品安全試験_IEC_制御機器計測機器_JIS_C_1010-1"]
[{"$nulls":4},"JIS C1010-2シリーズ",{"$nulls":47},405,3,0,null,null,"製品安全試験_IEC_制御機器計測機器_JIS_C_1010-2"]
[{"$nulls":3},"記載のない試験規格をご希望の場合はここにご記入ください",{"$nulls":48},406,3,3]
[{"$nulls":3},"注：下記に記載の規格番号及び表記が認定証に記載されます",{"$nulls":48},406,3,1]
[{"$nulls":3},"日本語規格番号",{"$nulls":10},"通則版",null,"英語規格番号",{"$nulls":10},"通則版",{"$nulls":24},406,3,1]
[{"$nulls":52},406,3,3,{"$f":"IF(D567= \"\",FALSE,TRUE)","v":false},null,{"$f":"IF(D567= \"\",\"\",\"製品安全試験_IEC_制御機器計測機器_\" & D567)","v":""},{"$f":"IF(D567= \"\",\"\",D567)","v":""},{"$f":"IF(D567= \"\",\"\",IF(Q567= \"\",\"\",Q567))","v":""},"製品安全試験_IEC_制御機器計測機器",null,"@@@"]
[{"$nulls":52},406,3,3,false,null,"","","","製品安全試験_IEC_制御機器計測機器",null,"@@@"]
[{"$nulls":52},406,3,3,false,null,"","","","製品安全試験_IEC_制御機器計測機器",null,"@@@"]
[{"$nulls":52},406,3,3,false,null,"","","","製品安全試験_IEC_制御機器計測機器",null,"@@@"]
[{"$nulls":52},406,3,3,false,null,"","","","製品安全試験_IEC_制御機器計測機器",null,"@@@"]
[{"$nulls":52},406,3,3,false,null,"","","","製品安全試験_IEC_制御機器計測機器",null,"@@@"]
[{"$nulls":52},406,3,3,false,null,"","","","製品安全試験_IEC_制御機器計測機器",null,"@@@"]
[{"$nulls":52},406,3,3,false,null,"","","","製品安全試験_IEC_制御機器計測機器",null,"@@@"]
[{"$nulls":52},406,3,3,false,null,"","","","製品安全試験_IEC_制御機器計測機器",null,"@@@"]
[{"$nulls":52},406,3,3,false,null,"","","","製品安全試験_IEC_制御機器計測機器",null,"@@@"]
[{"$nulls":3},"行追加",{"$nulls":48},406,3,1]

{"sheet":"認定試験実施設備入力","index":7,"n_rows":35,"n_cols":12,"rows_kept":35,"merged":[[2,0,2,6],[3,3,4,3],[3,4,4,6],[5,3,6,3],[5,4,6,6],[7,3,8,3],[7,4,8,6],[13,0,18,0],[19,0,25,0],[26,0,27,0]]}
["VLAC-VF100:2017(R11)"]
["発行年月日：2017年1月6日"]
["VLAC認定試験を実施する設備"]
["参考資料",null,null,"試験所："]
["VLAC-VF100:2016(R10)　試験所認定申請書"]
[{"$nulls":3},"試験場："]
["この表は試験場毎に作成して下さい。"]
[{"$nulls":3},"住所："]
[]
[]
[null,null,"当該設備で実施する試験区分に\"O\"を入力して下さい。"]
["試験区分",null,"設備　１","設備　２","設備　３","設備　４","設備　５","設備　６","設備　７","設備　８","設備　９","設備　１０"]
[null,"設備名称を入力→"]
["電磁両立性エミッション","放射妨害波基準大地面上"]
[null,"放射妨害波準自由空間"]
[null,"妨害波磁界強度"]
[null,"妨害波電力"]
[null,"伝導妨害波電源ポート"]
[null,"伝導妨害波通信ポート"]
["電磁両立性イミュニティ","静電気"]
[null,"放射電磁界"]
[null,"放射磁界"]
[null,"電気的過渡バースト"]
[null,"サージ"]
[null,"無線周波伝導妨害波"]
[null,"電源電圧変動"]
["放送受信機イミュニティ","伝導妨害波(S1,S2,S4)"]
[null,"放射電磁界(S3)"]
["電源高調波","高調波、電圧動揺"]
["音響","空気伝播騒音"]
["通信機性能-1","送信電力、信号特性"]
["通信機性能-2","電磁界ばく露"]
["通信機性能-3","電話端末機"]
["環境"]
["製品安全"]

{"sheet":"AccessImport_0","index":8,"n_rows":82,"n_cols":4,"rows_kept":82,"hidden":true}
["シート名","項目","値_1","値_2"]
["表紙","申請日",{"$f":"表紙!W2&\"/\"&表紙!AB2&\"/\"&表紙!AE2","v":"//"},"-"]
["表紙","申請種別_新規",false,"-"]
["表紙","申請種別_更新",false,{"$f":"表紙!P11","v":0}]
["表紙","申請種別_拡大",false,{"$f":"表紙!P13","v":0}]
["表紙","申請種別_変更",false,{"$f":"表紙!P15","v":0}]
["表紙","申請種別_初サーベイランス",false,{"$f":"表紙!P17","v":0}]
["表紙","申請種別_サーベイランス",false,{"$f":"表紙!P19","v":0}]
["表紙","試験所名称",{"$f":"表紙!K25","v":0},"-"]
["表紙","試験所所在地",{"$f":"表紙!S27","v":0},"-"]
["表紙","試験所郵便番号",{"$f":"表紙!L27","v":0},{"$f":"表紙!O27","v":0}]
["表紙","代表者の所属",{"$f":"表紙!K29","v":0},"-"]
["表紙","代表者氏名",{"$f":"表紙!K31","v":0},"-"]
["表紙","連絡担当者郵便番号",{"$f":"表紙!L33","v":0},{"$f":"表紙!O33","v":0}]
["表紙","連絡担当者所在地",{"$f":"表紙!S33","v":0},"-"]
["表紙","連絡担当者所属",{"$f":"表紙!K35","v":0},"-"]
["表紙","連絡担当者氏名",{"$f":"表紙!K37","v":0},"-"]
["表紙","連絡担当者電話番号",{"$f":"表紙!K39","v":0},"-"]
["表紙","連絡担当者FAX番号",{"$f":"表紙!K41","v":0},"-"]
["表紙","連絡担当者Email",{"$f":"表紙!K43","v":0},"-"]
["表紙","試験場_1_主試験場",false,{"$f":"IF(表紙!AA51=\"\",\"\",表紙!AA51)","v":""}]
["表紙","試験場_2_主試験場",false,{"$f":"IF(表紙!AA59=\"\",\"\",表紙!AA59)","v":""}]
["表紙","試験場_3_主試験場",false,{"$f":"IF(表紙!AA67=\"\",\"\",表紙!AA67)","v":""}]
["表紙","試験場_4_主試験場",false,{"$f":"IF(表紙!AA75=\"\",\"\",表紙!AA75)","v":""}]
["表紙","試験場_5_主試験場",false,{"$f":"IF(表紙!AA83=\"\",\"\",表紙!AA83)","v":""}]
["表紙","試験場_6_主試験場",false,{"$f":"IF(表紙!AA91=\"\",\"\",表紙!AA91)","v":""}]
["表紙","試験場_7_主試験場",false,{"$f":"IF(表紙!AA99=\"\",\"\",表紙!AA99)","v":""}]
["表紙","試験場_8_主試験場",false,{"$f":"IF(表紙!AA107=\"\",\"\",表紙!AA107)","v":""}]
["表紙","試験場_1_名称",{"$f":"表紙!E51","v":0},{"$f":"IF(表紙!AA51=\"\",\"\",表紙!AA51)","v":""}]
["表紙","試験場_2_名称",{"$f":"表紙!E59","v":0},{"$f":"IF(表紙!AA59=\"\",\"\",表紙!AA59)","v":""}]
["表紙","試験場_3_名称",{"$f":"表紙!E67","v":0},{"$f":"IF(表紙!AA67=\"\",\"\",表紙!AA67)","v":""}]
["表紙","試験場_4_名称",{"$f":"表紙!E75","v":0},{"$f":"IF(表紙!AA75=\"\",\"\",表紙!AA75)","v":""}]
["表紙","試験場_5_名称",{"$f":"表紙!E83","v":0},{"$f":"IF(表紙!AA83=\"\",\"\",表紙!AA83)","v":""}]
["表紙","試験場_6_名称",{"$f":"表紙!E91","v":0},{"$f":"IF(表紙!AA91=\"\",\"\",表紙!AA91)","v":""}]
["表紙","試験場_7_名称",{"$f":"表紙!E99","v":0},{"$f":"IF(表紙!AA99=\"\",\"\",表紙!AA99)","v":""}]
["表紙","試験場_8_名称",{"$f":"表紙!E107","v":0},{"$f":"IF(表紙!AA107=\"\",\"\",表紙!AA107)","v":""}]
["表紙","試験場_1_郵便番号",{"$f":"表紙!E54","v":0},{"$f":"表紙!H54","v":0}]
["表紙","試験場_2_郵便番号",{"$f":"表紙!E62","v":0},{"$f":"表紙!H62","v":0}]
["表紙","試験場_3_郵便番号",{"$f":"表紙!E70","v":0},{"$f":"表紙!H70","v":0}]
["表紙","試験場_4_郵便番号",{"$f":"表紙!E78","v":0},{"$f":"表紙!H78","v":0}]
["表紙","試験場_5_郵便番号",{"$f":"表紙!E86","v":0},{"$f":"表紙!H86","v":0}]
["表紙","試験場_6_郵便番号",{"$f":"表紙!E94","v":0},{"$f":"表紙!H94","v":0}]
["表紙","試験場_7_郵便番号",{"$f":"表紙!E102","v":0},{"$f":"表紙!H102","v":0}]
["表紙","試験場_8_郵便番号",{"$f":"表紙!E110","v":0},{"$f":"表紙!H110","v":0}]
["表紙","試験場_1_住所",{"$f":"表紙!E56","v":0},"-"]
["表紙","試験場_2_住所",{"$f":"表紙!E64","v":0},"-"]
["表紙","試験場_3_住所",{"$f":"表紙!E72","v":0},"-"]
["表紙","試験場_4_住所",{"$f":"表紙!E80","v":0},"-"]
["表紙","試験場_5_住所",{"$f":"表紙!E88","v":0},"-"]
["表紙","試験場_6_住所",{"$f":"表紙!E96","v":0},"-"]
["表紙","試験場_7_住所",{"$f":"表紙!E104","v":0},"-"]
["表紙","試験場_8_住所",{"$f":"表紙!E112","v":0},"-"]
["表紙","試験場数",{"$f":"COUNTIF(C29:C36,\"<>0\")","v":0},"-"]
["表紙","主試験場枝番号",{"$f":"IF(試験場_1_主試験場,D21,IF(試験場_2_主試験場,D22,IF(試験場_3_主試験場,D23,IF(試験場_4_主試験場,D24,IF(試験場_5_主試験場,D25,IF(試験場_6_主試験場,D26,IF(試験場_7_主試験場,D27,IF(試験場_8_主試験場,D28,\"\"))))))))","v":""},"-"]
["基本情報入力","試験場_名称",{"$f":"基本情報入力!C3","v":0},{"$f":"IF(基本情報入力!Y3=\"\",\"\",基本情報入力!Y3)","v":""}]
["基本情報入力","試験場_郵便番号",{"$f":"基本情報入力!C6","v":0},{"$f":"基本情報入力!F6","v":0}]
["基本情報入力","試験場_住所",{"$f":"基本情報入力!C7","v":0},"-"]
["基本情報入力","英文認定証要否",{"$f":"IF(D58=1,TRUE,FALSE)","v":true},1]
["基本情報入力","VLAC記入欄_受付日",{"$f":"IF(基本情報入力!E67<>\"\",基本情報入力!E67,\"\")","v":""},"-"]
["基本情報入力","VLAC記入欄_受付番号",{"$f":"基本情報入力!J67","v":0},"-"]
["基本情報入力","VLAC記入欄_管理費区分",{"$f":"基本情報入力!N67","v":0},"-"]
["基本情報入力","VLAC記入欄_基本単位",{"$f":"基本情報入力!Q67","v":0},"-"]
["基本情報入力","VLAC記入欄_追加単位",{"$f":"基本情報入力!T67","v":0},"-"]
["基本情報入力","VLAC記入欄_内部校正",{"$f":"IF(D64=\"有\",TRUE,FALSE)","v":false},{"$f":"基本情報入力!W67","v":0}]
["基本情報入力","VLAC記入欄_認定範囲の品質システム",{"$f":"基本情報入力!Z67","v":0},"-"]
["基本情報入力","VLAC記入欄_現地調査有無",{"$f":"IF(D66=1,1,0)","v":1},1]
["基本情報入力","VLAC記入欄_審査員数",{"$f":"基本情報入力!S70","v":0},"-"]
["基本情報入力","VLAC記入欄_審査日数",{"$f":"基本情報入力!AA70","v":0},"-"]
["基本情報入力","VLAC記入欄_備考",{"$f":"基本情報入力!AE67","v":0},"-"]
["英文名称入力","英文試験所名称",{"$f":"英文名称入力!B5","v":0},"-"]
["英文名称入力","英文試験所所在地",{"$f":"英文名称入力!B8","v":0},"-"]
["英文名称入力","英文試験場名称",{"$f":"英文名称入力!B11","v":0},"-"]
["英文名称入力","英文試験場所在地",{"$f":"英文名称入力!B14","v":0},"-"]
["英文名称入力","英文試験所責任者名",{"$f":"英文名称入力!B17","v":0},"-"]
["英文名称入力","英文試験所責任者職責タイトル",{"$f":"英文名称入力!B20","v":0},"-"]
["英文名称入力","試験所責任者メールアドレス",{"$f":"英文名称入力!B23","v":0},"-"]
["英文名称入力","外部への試験業務サービス",{"$f":"IF(D77=1,TRUE,FALSE)","v":true},1]
["試験区分入力","試験場名称",{"$f":"試験区分入力!A3","v":0}]
["試験区分入力","試験場管理責任者名",{"$f":"試験区分入力!U3","v":0}]
["試験区分入力","試験場管理責任者_所属",{"$f":"試験区分入力!U4","v":0}]
["試験区分入力","試験場管理責任者_Email",{"$f":"試験区分入力!AB3","v":0}]
["試験区分入力","試験場管理責任者_電話番号",{"$f":"試験区分入力!AJ3","v":0}]

{"sheet":"AccessImport_1","index":9,"n_rows":1,"n_cols":3,"rows_kept":1,"hidden":true}
["項番","階層","試験項目コード"]

{"sheet":"AccessImport_2","index":10,"n_rows":1,"n_cols":5,"rows_kept":1,"hidden":true}
["項番","階層","試験区分コード","測定周波数範囲最小","測定周波数範囲最大"]

{"sheet":"AccessImport","index":11,"n_rows":1,"n_cols":9,"rows_kept":1,"hidden":true}
["項番","階層","試験規格コード","日本語文言","英語文言","親試験規格","枝番","新規格フラグ","下位試験規格コード"]

{"sheet":"試験項目マスタ","index":12,"n_rows":77,"n_cols":8,"rows_kept":77,"hidden":true}
["試験項目コード","試験項目名称","試験項目名称英語","価格項目","表示順","申請書名称","階層","備考"]
["項目_エミ","エミッション","Emission","基本技術審査料金",1,"エミッション",1,""]
["項目_エミ_放射妨害波","放射妨害波","","追加技術審査料金０",2,"放射妨害波（FCC、CISPR11関連規格の1GHz超試験を含む）",2,""]
["項目_エミ_伝導妨害波","伝導妨害波","","追加技術審査料金０",3,"伝導妨害波",2,""]
["項目_イミ","イミュニティ","","基本技術審査料金",4,"イミュニティ",1,""]
["項目_イミ_静電気","静電気","","追加技術審査料金０",5,"静電気",2,""]
["項目_イミ_放射電磁界","放射電磁界","","追加技術審査料金０",6,"放射電磁界",2,""]
["項目_イミ_放射磁界","放射磁界","","追加技術審査料金０",7,"放射磁界",2,""]
["項目_イミ_電気的過渡バースト","電気的過渡バースト","","追加技術審査料金０",8,"電気的過度バースト",2,""]
["項目_イミ_サージ","サージ","","追加技術審査料金０",9,"サージ",2,""]
["項目_イミ_無線周波伝導妨害","無線周波伝導妨害","","追加技術審査料金０",10,"無線周波伝導妨害波",2,""]
["項目_イミ_電源電圧変動","電源電圧変動","","追加技術審査料金０",11,"電源電圧変動",2,""]
["項目_1GHz超放射妨害波エミ","1GHz超放射妨害波エミ","","追加技術審査料金１",12,"1GHz超放射妨害波エミッション(CISPR22関連規格, VCCI技術基準による1GHz超の試験）",1,""]
["項目_放送受信機イミ","放送受信機イミ","","追加技術審査料金１",13,"放送受信機イミュニティ",1,""]
["項目_放送受信機イミ_アンテナ端子","アンテナ端子","","追加技術審査料金０",14,"アンテナ端子",2,""]
["項目_放送受信機イミ_電源端子","電源端子","","追加技術審査料金０",15,"電源端子無線周波伝導妨害波",2,""]
["項目_放送受信機イミ_筺体放射電磁界","筺体放射電磁界","","追加技術審査料金０",16,"筐体放射電磁界",2,""]
["項目_放送受信機エミ","放送受信機エミ","","追加技術審査料金１",17,"放送受信機エミッション",1,""]
["項目_放送受信機エミ_放射妨害波","放射妨害波","","追加技術審査料金０",18,"放射妨害波",2,""]
["項目_放送受信機エミ_伝導妨害波","伝導妨害波","","追加技術審査料金０",19,"伝導妨害波",2,""]
["項目_電力送電機器イミ","電力送電機器イミュニティ","Electric power transmission equipment","追加技術審査料金１",20,"電力送電機器イミュニティ",1,""]
["項目_電力送電機器イミ_減衰振動波","減衰振動波","Dumped oscillatory wave immunity test","追加技術審査料金０",21,"減衰振動波",2,""]
["項目_電力送電機器イミ_リング振動波","リング振動波","Ring Wave immunity test","追加技術審査料金０",22,"リング振動波",2,""]
["項目_電力送電機器イミ_直流入力ポートリップル印加","直流入力ポートリップル印加","Ripple on DC input power port immunity test","追加技術審査料金０",23,"直流入力ポートリップル印加",2,""]
["項目_電源高調波","電源高調波","","追加技術審査料金１",24,"電源高調波",1,""]
["項目_電源高調波_高調波電流","高調波電流","","追加技術審査料金０",25,"高調波電流",2,""]
["項目_電源高調波_電源電圧動揺","電源電圧動揺","","追加技術審査料金０",26,"電源電圧動揺",2,""]
["項目_自動車車載機器","自動車・車載機器","","追加技術審査料金１",27,"自動車・車載機器",1,""]
["項目_自動車車載機器_ESA(車載部品)イミュニティ","ESA(車載部品)イミュニティ","","追加技術審査料金０",28,"ESA(車載部品)イミュニティ",2,""]
["項目_自動車車載機器_ESA(車載部品)エミッション","ESA(車載部品)エミッション","","追加技術審査料金０",29,"ESA(車載部品)エミッション",2,""]
["項目_自動車車載機器_自動車イミュニティ","自動車イミュニティ","","追加技術審査料金０",30,"自動車イミュニティ",2,""]
["項目_自動車車載機器_自動車エミッション","自動車エミッション","","追加技術審査料金０",31,"自動車エミッション",2,""]
["項目_空気伝搬騒音","空気伝搬騒音","","追加技術審査料金１",32,"音響(空気伝搬騒音)",1,""]
["項目_通信機器1","通信機器1","","追加技術審査料金１",33,"通信機器性能１",1,""]
["項目_通信機器1_送信電力","送信電力","","追加技術審査料金０",34,"送信電力",2,""]
["項目_通信機器1_スプリアス","スプリアス","","追加技術審査料金０",35,"スプリアス",2,""]
["項目_通信機器1_信号特性","信号特性","","追加技術審査料金０",36,"信号特性",2,""]
["項目_通信機器2","通信機器2","","追加技術審査料金１",37,"通信機器性能2",1,""]
["項目_通信機器2_電磁界ばく露_局所比吸収率","電磁界ばく露(局所比吸収率)","","追加技術審査料金０",38,"電磁界ばく露(局所比吸収率)",2,""]
["項目_通信機器2_電磁界ばく露_磁界強度","電磁界ばく露(磁界強度)","","追加技術審査料金０",39,"電磁界ばく露(磁界強度)",2,""]
["項目_通信機器3","通信機器3","","追加技術審査料金１",40,"通信機器性能3",1,""]
["項目_通信機器3_有線通信機器","有線通信機器","","追加技術審査料金０",41,"公衆回線接続通信端末機器試験",2,""]
["項目_環境","環境","","追加技術審査料金１",42,"環境",1,""]
["項目_環境_国際エネルギースタープログラム","国際エネルギースタープログラム","","追加技術審査料金０",43,"国際エネルギースタープログラム",2,""]
["項目_環境_消費電力","消費電力","","追加技術審査料金０",44,"消費電力",2,""]
["項目_環境_米国エネルギースタープログラム","米国エネルギースタープログラム","","追加技術審査料金０",45,"米国エネルギースタープログラム",2,""]
["項目_製品安全","製品安全","","追加技術審査料金１",46,"製品安全",1,""]
["項目_製品安全_家電製品","家電製品","","追加技術審査料金２",47,"家電製品",2,""]
["項目_製品安全_IT機器","IT機器","","追加技術審査料金２",48,"IT機器",2,""]
["項目_製品安全_AV機器","AV機器","","追加技術審査料金２",49,"AV機器",2,""]
["項目_製品安全_医用電気機器","医用電気機器","","追加技術審査料金２",50,"医用電気機器",2,""]
["項目_製品安全_制御機器計測機器","制御機器計測機器","","追加技術審査料金２",51,"制御機器計測機器",2,""]
["項目_環境2","環境","","追加技術審査料金３",52,"-",1,"***申請書上に無し***"]
["項目_環境2_国際エネルギースタープログラム2","国際エネルギースタープログラム","","追加技術審査料金０",53,"-",2,"***申請書上に無し***"]
["項目_環境2_米国エネルギースタープログラム2","米国エネルギースタープログラム","","追加技術審査料金０",54,"-",2,"***申請書上に無し***"]
["項目_環境2_消費電力2","消費電力","","追加技術審査料金０",55,"-",2,"***申請書上に無し***"]
["項目_家電製品2","家電製品","","追加技術審査料金３",56,"-",1,"***申請書上に無し***"]
["項目_IT機器2","IT機器","","追加技術審査料金３",57,"-",1,"***申請書上に無し***"]
["項目_AV機器2","AV機器","","追加技術審査料金３",58,"-",1,"***申請書上に無し***"]
["項目_医用電気機器2","医用電気機器","","追加技術審査料金３",59,"-",1,"***申請書上に無し***"]
["項目_制御機器計測機器2","制御機器計測機器","","追加技術審査料金３",60,"-",1,"***申請書上に無し***"]
["項目_空気伝搬騒音2","空気伝搬騒音","Acoustic(Airborne Noise Emission)","追加技術審査料金３",61,"-",1,"***申請書上に無し***"]
["追加項目01","追加項目01","","追加技術審査料金１",62,"-",1,"***申請書上に無し***"]
["追加項目02","追加項目02","","追加技術審査料金１",63,"-",1,"***申請書上に無し***"]
["追加項目03","追加項目03","","追加技術審査料金１",64,"-",1,"***申請書上に無し***"]
["追加項目04","追加項目04","","追加技術審査料金１",65,"-",1,"***申請書上に無し***"]
["追加項目05","追加項目05","","追加技術審査料金１",66,"-",1,"***申請書上に無し***"]
["追加項目06","追加項目06","","追加技術審査料金２",67,"-",1,"***申請書上に無し***"]
["追加項目07","追加項目07","","追加技術審査料金２",68,"-",1,"***申請書上に無し***"]
["追加項目08","追加項目08","","追加技術審査料金２",69,"-",1,"***申請書上に無し***"]
["追加項目09","追加項目09","","追加技術審査料金２",70,"-",1,"***申請書上に無し***"]
["追加項目10","追加項目10","","追加技術審査料金２",71,"-",1,"***申請書上に無し***"]
["追加項目11","追加項目11","","追加技術審査料金３",72,"-",1,"***申請書上に無し***"]
["追加項目12","追加項目12","","追加技術審査料金３",73,"-",1,"***申請書上に無し***"]
["追加項目13","追加項目13","","追加技術審査料金３",74,"-",1,"***申請書上に無し***"]
["追加項目14","追加項目14","","追加技術審査料金３",75,"-",1,"***申請書上に無し***"]
["追加項目15","追加項目15","","追加技術審査料金３",76,"-",1,"***申請書上に無し***"]

{"sheet":"試験区分マスタ","index":13,"n_rows":206,"n_cols":9,"rows_kept":206,"hidden":true}
["試験区分コード","試験区分名称","試験区分名称英語","文書様式","親試験区分コード","階層","表示順","備考","申請書名称"]
["エミ","エミッション","Emission test","","試験区分",1,1,"","5．試験区分－電磁両立性 エミッション"]
["エミ_放射_エンク","放射妨害波_エンクロージャーポート","Radiated disturbance : Enclosure Port","","エミ",2,2,"","5.1．放射妨害波 （エンクロージャーポート）"]
["エミ_放射_エンク_妨害電界","妨害電界強度試験 (CISPR 16-2-3, ANSI C63.4:2003/2009)","Disturbance electric field test","","エミ_放射_エンク",3,3,"","放射妨害波電界強度試験"]
["エミ_放射_エンク_妨害電界_基準","[試験条件]基準大地面上","On the reference ground plane","","エミ_放射_エンク_妨害電界",4,4,"","基準大地面上（付属書：VF102またはVF103）"]
["エミ_放射_エンク_妨害電界_基準_測定周波数範囲","測定周波数範囲：30MHz～$MAXGHz","Measurement Frequency Range : 30MHz～$MAXGHz","","エミ_放射_エンク_妨害電界_基準",5,5,"","測定周波数範囲"]
["エミ_放射_エンク_妨害電界_基準_車載機器","基準大地面上：車載機器試験（1m法）","On the reference ground plane: In-vehicle equipment test(1m Method)","","エミ_放射_エンク_妨害電界_基準",5,6,"","基準大地面上：車載機器試験(1m法)（付属書：VF170）"]
["エミ_放射_エンク_妨害電界_基準_車載機器_測定周波数範囲","測定周波数範囲：$MINkHz～$MAXGHz","Measurement Frequency Range :  $MINkHz～$MAXGHz","","エミ_放射_エンク_妨害電界_基準_車載機器",6,7,"","測定周波数範囲"]
["エミ_放射_エンク_妨害電界_準自由_VF152","[試験条件]準自由空間","Qasi free space","","エミ_放射_エンク_妨害電界",4,8,"","準自由空間（付属書：VF-152）"]
["エミ_放射_エンク_妨害電界_準自由_VF152_1GHz","測定周波数範囲：1GHｚ～$MAXGHz","Measurement Frequency Range : 1GHｚ～$MAXGHz","","エミ_放射_エンク_妨害電界_準自由_VF152",5,9,"","測定周波数範囲"]
["エミ_放射_エンク_妨害電界_準自由_VF153","準自由空間","Quasi Free Space(VF-153)","","エミ_放射_エンク_妨害電界",4,10,"","準自由空間（付属書：VF-153）"]
["エミ_放射_エンク_妨害電界_準自由_VF153_測定周波数範囲","測定周波数範囲： $MIN～$MAX","Measurement Frequency Range : $MIN～$MAX","","エミ_放射_エンク_妨害電界_準自由_VF153",5,11,"","測定周波数範囲"]
["エミ_放射_エンク_妨害磁界","妨害磁界強度試験","Disturbance magnetic field strength measurement","","エミ_放射_エンク",3,12,"","放射妨害波磁界強度試験"]
["エミ_放射_エンク_妨害磁界_ループアンテナ","[試験条件]ループアンテナ","Loop Antenna","","エミ_放射_エンク_妨害磁界",4,13,"","ループアンテナ"]
["エミ_放射_エンク_妨害磁界_3軸ループ","[試験条件]3軸ループ","Three axis loop antenna","","エミ_放射_エンク_妨害磁界",4,14,"","3軸ループ（ラージループ）"]
["エミ_放射_エンク_妨害磁界_等方性プローブ","[試験条件]等方性プローブ","Isotropic probe ","","エミ_放射_エンク_妨害磁界",4,15,"","等方性プローブ"]
["エミ_放射_エンク_その他放射妨害波試験","その他放射妨害波試験","Other radiated interference tests","","エミ_放射_エンク",3,16,"","その他の放射妨害波試験"]
["エミ_放射_エンク_その他放射妨害波試験_TEMセル法","TEMセル法（付属書：VF128B-TEM）注：本版では認定範囲から除外","TEM CELL","","エミ_放射_エンク_その他放射妨害波試験",4,17,"***申請書上から削除済み***","-"]
["エミ_放射_エンク_その他放射妨害波試験_TEMセル法_測定周波数範囲","測定周波数範囲： $MIN～$MAX","Measurement Frequency Range : $MIN～$MAX","","エミ_放射_エンク_その他放射妨害波試験_TEMセル法",5,18,"***申請書上から削除済み***","-"]
["エミ_放射_エンク_その他放射妨害波試験_反射箱法","反射箱法：RVC（付属書：VF128B-RVC）注：本版では認定範囲から除外","Reverberation Chamber","","エミ_放射_エンク_その他放射妨害波試験",4,19,"***申請書上から削除済み***","-"]
["エミ_放射_エンク_その他放射妨害波試験_反射箱法_測定周波数範囲","測定周波数範囲： $MIN～$MAX","Measurement Frequency Range : $MIN～$MAX","","エミ_放射_エンク_その他放射妨害波試験_反射箱法",5,20,"***申請書上から削除済み***","-"]
["エミ_放射_エンク_妨害電力","妨害電力試験","Disturbance power measurement","","エミ",2,21,"","5.2．妨害波電力試験（AC電源ポート）"]
["エミ_放射_エンク_妨害電力_CMAD_クランプ","[試験条件]CMAD(クランプ)","CMAD","","エミ_放射_エンク_妨害電力",3,22,"","吸収クランプ (CMAD)"]
["エミ_伝導_AC電源","伝導妨害波電圧試験(CISPR 16-2-1, ANSI C63.4:2003/3009) AC電源ポート","Conducted disturbance, AC mains port","","エミ",2,23,"","5.3．AC電源ポート伝導妨害波試験（付属書：VF104）"]
["エミ_伝導_AC電源_妨害電圧","妨害電圧試験","Disturbance voltage measurement","","エミ_伝導_AC電源",3,24,"","妨害波電圧試験"]
["エミ_伝導_AC電源_妨害電圧_AMN","[試験条件]疑似電源回路網(CISPR16-1-2)","AMN","","エミ_伝導_AC電源_妨害電圧",4,25,"","AMN"]
["エミ_伝導_AC電源_妨害電圧_高インピーダンスプローブ","[試験条件]高インピーダンスプローブ(CISPR16-1-2)","High-impedance probe","","エミ_伝導_AC電源_妨害電圧",4,26,"","高インピーダンスプローブ"]
["エミ_伝導_通信","伝導妨害波_通信ポート","Conductive interference_telecommunication port","","エミ",2,27,"","5.4．通信ポート伝導妨害波試験（付属書：VF117）"]
["エミ_伝導_通信_妨害電圧","妨害電圧試験(CISPR 22 Clause 9.6 and Annex C)","Disturbance voltage measurement","","エミ_伝導_通信",3,28,"","妨害波電圧試験"]
["エミ_伝導_通信_妨害電圧_AAN","[試験条件]疑似電源回路網(CISPR 22 Clause 9.6 and Annex D)","AAN","","エミ_伝導_通信_妨害電圧",4,29,"","AAN"]
["エミ_伝導_通信_妨害電圧_容量性電圧プローブ","[試験条件]容量性電圧プローブ(CISPR16-1-2)","Capacitive voltage probe","","エミ_伝導_通信_妨害電圧",4,30,"","容量性電圧プローブ"]
["エミ_伝導_通信_妨害電流","妨害電流試験(CISPR 22 Clause 9.6 and Annex C)","Disturbance current measurement","","エミ_伝導_通信",3,31,"","妨害波電流試験"]
["エミ_伝導_通信_妨害電流_電流プローブ","[試験条件]電流プローブ(CISPR 16-1-2)","Current probe","","エミ_伝導_通信_妨害電流",4,32,"","電流プローブ"]
["エミ_伝導_DC電源","伝導妨害波_DC電源ポート","Conductive interference_DC power line port","","エミ",2,33,"","5.5．DC電源ポート伝導妨害波試験 （付属書：VF171）"]
["エミ_伝導_DC電源_妨害電圧","妨害電圧試験","Disturbance voltage measurement","","エミ_伝導_DC電源",3,34,"","妨害波電圧試験"]
["エミ_伝導_DC電源_妨害電圧_AMN","[試験条件]疑似電源回路網","AMN","","エミ_伝導_DC電源_妨害電圧",4,35,"","AMN"]
["エミ_伝導_DC電源_妨害電圧_高インピーダンスプローブ","[試験条件]高インピーダンスプローブ","High-impedance probe","","エミ_伝導_DC電源_妨害電圧",4,36,"","高インピーダンスプローブ"]
["エミ_伝導_PLC","伝導妨害波_PLCポート","Conductive interference_PLC port","","エミ",2,37,"","5.6．PLCポート伝導妨害波試験"]
["エミ_伝導_PLC_妨害電流","妨害電流試験","Disturbance current measurement","","エミ_伝導_PLC",3,38,"","妨害波電流試験"]
["エミ_伝導_PLC_妨害電流_電流プローブ","[試験条件]電流プローブ","Current probe","","エミ_伝導_PLC_妨害電流",4,39,"","電流プローブ"]
["エミ_アンテナ","4.7 アンテナポート、RFモジュレーター出力ポート、チューナーポート、ファイバーポート伝導妨害波試験(付属書:VF117)","4.7 Antenna port, RF modulator output port, Tuner port, Fiber port","","エミ",2,40,"","5.7．アンテナポート、RFモジュレーター出力ポート、チューナポート、ファイバーポート伝導妨害波試験（付属書：VF117）"]
["エミ_アンテナ_妨害電圧","妨害電圧試験(CISPR 22 Clause 9.6 and Annex C)","Disturbance voltage measurement",null,"エミ_アンテナ",3,41,null,"妨害波電圧試験"]
["エミ_アンテナ_妨害電圧_AAN","[試験条件]疑似電源回路網(CISPR 22 Clause 9.6 and Annex D)","AAN",null,"エミ_アンテナ_妨害電圧",4,42,null,"AAN"]
["エミ_アンテナ_妨害電圧_容量性電圧プローブ","[試験条件]容量性電圧プローブ(CISPR16-1-2)","Capacitive voltage probe",null,"エミ_アンテナ_妨害電圧",4,43,null,"容量性電圧プローブ"]
["エミ_アンテナ_妨害電流","妨害電流試験(CISPR 22 Clause 9.6 and Annex C)","Disturbance current measurement",null,"エミ_アンテナ",3,44,null,"妨害波電流試験"]
["エミ_アンテナ_妨害電流_妨害電流_電流プローブ","[試験条件]電流プローブ(CISPR 16-1-2)","Current probe",null,"エミ_アンテナ_妨害電流",4,45,null,"電流プローブ"]
["エミ_アンテナ_希望信号電圧および妨害端子電圧試験","希望信号電圧および妨害端子電圧試験","Wanted signal and disturbance voltage test at the RF output","","エミ_アンテナ",3,46,"","希望信号電圧および妨害波端子電圧試験"]
["エミ_アンテナ_希望信号電圧および妨害端子電圧試験_選択性高周波電圧計","選択性高周波電圧計","Selective voltmeter","","エミ_アンテナ_希望信号電圧および妨害端子電圧試験",3,47,"","選択性高周波電圧計"]
["エミ_アンテナ_屋外ユニット局部発振放射電力試験","屋外ユニット局部発振放射電力試験","Local oscillator power at the input terminal of the outdoor unit","","エミ_アンテナ",3,48,"","屋外ユニット局部発振放射電力試験"]
["イミ","イミュニティ","Immunity test","","試験区分",1,49,"","6．試験区分－電磁両立性イミュニティ"]
["イミ_静電気","静電気","Electro static discharge (ESD)","","イミ",2,50,"","6.1．静電気（VF128A）"]
["イミ_静電気_静電気放電","静電気放電試験(IEC61000-4-2/EN61000-4-2)","Electro static discharge test","","イミ_静電気",3,51,"","静電気放電試験"]
["イミ_静電気_IEC61000_4_2","IEC61000-4-2/EN 61000-4-2","IEC61000-4-2/EN 61000-4-2","","イミ_静電気",3,52,"","IEC 61000-4-2/EN 61000-4-2"]
["エミ_伝導_DC電源_車載機器","車載機器伝導妨害波試験","","","エミ_伝導_DC電源",3,53,"","車載機器伝導妨害波試験"]
["イミ_静電気_ISO_10605","ISO 10605","ISO 10605","","イミ_静電気",3,54,"","ISO 10605"]
["イミ_放射電磁界","放射電磁界","Radiated electromagnetic field strength","","イミ",2,55,"","6.2．放射電磁界"]
["イミ_放射電磁界_放射電磁界イミ_疑似自由空間アンテナ放射","放射電磁界イミュニティ試験(IEC61000-4-3/EN61000-4-3)","Radiated electromagnetic field strength immunity test(Quasi free space antenna radiation)","","イミ_放射電磁界",3,56,"","放射電磁界イミュニティ試験(擬似自由空間アンテナ放射) (VF128B)"]
["イミ_放射電磁界_放射電磁界イミ_疑似自由空間アンテナ放射_IEC_61000_4_3","IEC 61000-4-3/EN 61000-4-3 測定周波数範囲： $MIN～$MAX","IEC 61000-4-3/EN 61000-4-3 Measurement Frequency Range : $MIN～$MAX","","イミ_放射電磁界_放射電磁界イミ_疑似自由空間アンテナ放射",4,57,"","測定周波数範囲"]
["イミ_放射電磁界_放射電磁界イミ_疑似自由空間アンテナ放射_IEC_61000_4_22","IEC 61000-4-22/EN 61000-4-22 測定周波数範囲： $MIN～$MAX","IEC 61000-4-22/EN 61000-4-22 Measurement Frequency Range : $MIN～$MAX","","イミ_放射電磁界_放射電磁界イミ_疑似自由空間アンテナ放射",4,58,"","測定周波数範囲"]
["イミ_放射電磁界_放射電磁界イミ_疑似自由空間アンテナ放射_ISO_11452_2","ISO 11452-2 測定周波数範囲： $MIN～$MAX","ISO 11452-2 Measurement Frequency Range : $MIN～$MAX","","イミ_放射電磁界_放射電磁界イミ_疑似自由空間アンテナ放射",4,59,"","測定周波数範囲"]
["イミ_放射電磁界_放射電磁界イミ_TEMセル","放射電磁界イミュニティ試験(TEMセル)","Radiated electromagnetic field strength immunity test(TEM CELL)","","イミ_放射電磁界",3,60,"","放射電磁界イミュニティ試験（TEMセル、ストリップライン）（VF128B-TEM）"]
["イミ_放射電磁界_放射電磁界イミ_TEMセル_IEC_61000_4_20","IEC 61000-4-20/EN 61000-4-20 測定周波数範囲： $MIN～$MAX","IEC 61000-4-20/EN 61000-4-20 Measurement Frequency Range : $MIN～$MAX","","イミ_放射電磁界_放射電磁界イミ_TEMセル",4,61,"","測定周波数範囲"]
["イミ_放射電磁界_放射電磁界イミ_TEMセル_ISO_11452_3","ISO 11452-3 測定周波数範囲： $MIN～$MAX","ISO 11452-3 Measurement Frequency Range : $MIN～$MAX","","イミ_放射電磁界_放射電磁界イミ_TEMセル",4,62,"","測定周波数範囲"]
["イミ_放射電磁界_放射電磁界イミ_TEMセル_ISO_11452_5","ISO 11452-5 測定周波数範囲： $MIN～$MAX","ISO 11452-5 Measurement Frequency Range : $MIN～$MAX","","イミ_放射電磁界_放射電磁界イミ_TEMセル",4,63,"","測定周波数範囲"]
["イミ_放射電磁界_放射電磁界イミ_反射箱","放射電磁界イミュニティ試験(反射箱)","Radiated electromagnetic field strength immunity test(Reverberation chamber)","","イミ_放射電磁界",3,64,"","放射電磁界イミュニティ試験（反射箱）（VF128B-RVC）"]
["イミ_放射電磁界_放射電磁界イミ_反射箱_IEC_61000_4_21","IEC 61000-4-21/EN 61000-4-21 測定周波数範囲： $MIN～$MAX","IEC 61000-4-21/EN 61000-4-21 Measurement Frequency Range : $MIN～$MAX","","イミ_放射電磁界_放射電磁界イミ_反射箱",4,65,"","測定周波数範囲"]
["イミ_放射磁界","放射磁界","Radiated magnetic field","","イミ",2,66,"","6.6．放射磁界 （VF128F）"]
["イミ_放射磁界_電源周波数磁界イミ","電源周波数磁界イミュニティ試験(IEC61000-4-8/EN61000-4-8)","Power frequency magnetic field immunity test","","イミ_放射磁界",3,67,"","磁界イミュニティ試験（ループコイル、ヘルムホルツコイル）"]
["イミ_放射磁界_電源周波数磁界イミ_IEC_61000_4_8","IEC 61000-4-8/EN 61000-4-8","IEC 61000-4-8/EN 61000-4-8","","イミ_放射磁界_電源周波数磁界イミ",4,68,"","IEC 61000-4-8/EN 61000-4-8"]
["イミ_放射磁界_電源周波数磁界イミ_IEC_61000_4_9","IEC 61000-4-9/EN 61000-4-9","IEC 61000-4-9/EN 61000-4-9","","イミ_放射磁界_電源周波数磁界イミ",4,69,"","IEC 61000-4-9/EN 61000-4-9"]
["イミ_放射磁界_電源周波数磁界イミ_ISO_11452_8","ISO 11452-8","ISO 11452-8","","イミ_放射磁界_電源周波数磁界イミ",4,70,"","ISO 11452-8"]
["イミ_電気的過渡バースト","電気的過渡バースト(IEC61000-4-4/EN61000-4-4)通信/信号ポート","Electrical fast transient/burst immunity test (EFT/B)","","イミ",2,71,"","6.3．電気的過渡バースト （VF128C）"]
["イミ_電気的過渡バースト_IEC_61000_4_4","IEC 61000-4-4/EN 61000-4-4","IEC 61000-4-4/EN 61000-4-4","","イミ_電気的過渡バースト",3,72,"","IEC 61000-4-4/EN 61000-4-4"]
["イミ_電気的過渡バースト_電源ポート伝導イミ","電源ポート伝導イミュニティ試験","Conducted immunity test, Mains port","","イミ_電気的過渡バースト",3,73,"","電源ポート伝導イミュニティ試験"]
["イミ_電気的過渡バースト_通信_信号ポート伝導イミ","通信／信号ポート伝導イミュニティ試験","Conducted immunity test, Telecommunication/Signal port ","","イミ_電気的過渡バースト",3,74,"","通信／信号ポート伝導イミュニティ試験"]
["イミ_電気的過渡バースト_ISO_7637_2","ISO 7637-2（CDN）","ISO 7637-2（CDN）","","イミ_電気的過渡バースト",3,75,"","ISO 7637-2 （CDN）"]
["イミ_電気的過渡バースト_ISO_7637_3","ISO 7637-3（容量性結合器）","ISO 7637-3（capacitive coupler）","","イミ_電気的過渡バースト",3,76,"","ISO 7637-3　（容量性結合器）"]
["イミ_サージ","サージ(IEC61000-4-5/EN61000-4-5)通信/信号ポート","Surge","","イミ",2,77,"","6.4．サージ  （VF128D）"]
["イミ_サージ_IEC_61000_4_5","IEC 61000-4-5/EN 61000-4-5","IEC 61000-4-5/EN 61000-4-5","","イミ_サージ",3,78,"","IEC 61000-4-5/EN 61000-4-5"]
["イミ_サージ_電源ポートサージイミ","電源ポートサージイミュニティ試験","Surge immunity test, Mains port ","","イミ_サージ",3,79,"","電源ポートサージイミュニティ試験"]
["イミ_サージ_通信_信号ポートサージイミ","通信／信号ポートサージイミュニティ試験","Surge immunity test, Telecommunication/Signal port","","イミ_サージ",3,80,"","通信／信号ポートサージイミュニティ試験"]
["イミ_無線周波伝導妨害","無線周波伝導妨害(IEC61000-4-6/EN61000-4-6)通信/信号ポート","RF conducted interference","","イミ",2,81,"","6.5．無線周波伝導妨害波 （VF128E）"]
["イミ_無線周波伝導妨害_IEC_61000_4_6","IEC 61000-4-6/EN 61000-4-6","IEC 61000-4-6/EN 61000-4-6","","イミ_無線周波伝導妨害",3,82,"","IEC 61000-4-6/EN 61000-4-6"]
["イミ_無線周波伝導妨害_IEC_61000_4_16","IEC 61000-4-16/EN 61000-4-16","IEC 61000-4-16/EN 61000-4-16","","イミ_無線周波伝導妨害",3,83,"","IEC 61000-4-16/EN 61000-4-16"]
["イミ_無線周波伝導妨害_電源ポート無線周波伝導イミ","電源ポート無線周波伝導イミュニティ試験 測定周波数範囲： $MIN～$MAX","Mains port RF conductive immunity test measurement frequency range : $MIN～$MAX","","イミ_無線周波伝導妨害",3,84,"","測定周波数範囲"]
["イミ_無線周波伝導妨害_通信_信号ポート無線周波伝導イミ","通信／信号ポート無線周波伝導イミュニティ試験 測定周波数範囲： $MIN～$MAX","Telecommunication port RF conductive immunity test measurement frequency range : $MIN～$MAX","","イミ_無線周波伝導妨害",3,85,"","測定周波数範囲"]
["イミ_無線周波伝導妨害_ISO_11452_4","ISO 11452-4 測定周波数範囲： $MIN～$MAX","ISO 11452-4 Measurement Frequency Range : $MIN～$MAX","","イミ_無線周波伝導妨害",3,86,"","測定周波数範囲"]
["イミ_無線周波伝導妨害_ISO_11452_9","ISO 11452-9 測定周波数範囲： $MIN～$MAX","ISO 11452-9 Measurement Frequency Range : $MIN～$MAX","","イミ_無線周波伝導妨害",3,87,"","測定周波数範囲"]
["イミ_電源電圧変動","電源瞬停・ディップ(IEC61000-4-11/EN61000-4-11)","Voltage variations","","イミ",2,88,"","6.7．電源電圧変動 （VF128G）"]
["イミ_電源電圧変動_電源電圧ディップ瞬停","電源電圧変動_電源電圧ディップ瞬停試験","Voltage dips, short interruptions and voltage variations immunity tests","","イミ_電源電圧変動",3,89,"","電源電圧ディップ・瞬停試験"]
["イミ_電源電圧変動_電源電圧ディップ瞬停_IEC_61000_4_11","IEC 61000-4-11/EN 61000-4-11","IEC 61000-4-11/EN 61000-4-11","","イミ_電源電圧変動_電源電圧ディップ瞬停",4,90,"","IEC 61000-4-11/EN 61000-4-11"]
["イミ_電源電圧変動_電源電圧ディップ瞬停_IEC_61000_4_29","IEC 61000-4-29/EN 61000-4-29","IEC 61000-4-29/EN 61000-4-29",null,"イミ_電源電圧変動_電源電圧ディップ瞬停",4,91,null,"IEC 61000-4-29/EN 61000-4-29"]
["イミ_放送受信機イミ","放送受信機イミュニティ","Broadcasting receiver immunity","","イミ",2,92,"","6.8．放送受信機イミュニティ"]
["イミ_放送受信機イミ_アンテナ端子","アンテナ端子","Antenna terminal","","イミ_放送受信機イミ",3,93,"***申請書上から削除済み***","-"]
["イミ_放送受信機イミ_アンテナ端子_2信号または3信号特性","2信号または3信号特性試験","Two signals/Three signals characteristics test","","イミ_放送受信機イミ",4,94,"","2信号または3信号特性試験（S1）"]
["イミ_放送受信機イミ_アンテナ端子_同軸遮蔽減衰量","同軸遮蔽減衰量試験","Coaxial shield attenuation test","","イミ_放送受信機イミ",4,95,"","同軸遮蔽減衰量試験（S4）"]
["イミ_放送受信機イミ_電源端子無線周波伝導妨害","電源端子無線周波伝導妨害","RF conducted interference, Mains terminal","","イミ_放送受信機イミ",4,96,"***申請書上から削除済み***","-"]
["イミ_放送受信機イミ_電源端子無線周波伝導妨害_電源ポート","電源ポート無線周波伝導妨害試験","RF conducted immunity test, Mains port","","イミ_放送受信機イミ",4,97,"","電源ポート無線周波伝導妨害波試験（S2）"]
["イミ_放送受信機イミ_放射電磁界","放射電磁界","Radiated electromagnetic field","","イミ_放送受信機イミ",4,98,"***申請書上から削除済み***","-"]
["イミ_放送受信機イミ_放射電磁界_電磁界イミ_オープンストリップライン","電磁界イミュニティ試験(オープンストリップライン)","Electric magnetic field immunity test(open strip line)","","イミ_放送受信機イミ",4,99,"","電磁界イミュニティ試験（オープンストリップライン）（S3）"]
["イミ_電力送電機器イミュニティ","電力送電機器イミュニティ","Power transmission equipment Immunity test","","イミ",2,100,"","6.9．電力送電機器イミュニティ"]
["イミ_電力送電機器イミュニティ_減衰振動波","減衰振動波","Dumped oscilatory wave Immunity test","","イミ_電力送電機器イミュニティ",3,101,"","減衰振動波"]
["イミ_電力送電機器イミュニティ_リング振動波","リング振動波","Ring wave immunity test","","イミ_電力送電機器イミュニティ",3,102,"","リング振動波"]
["イミ_電力送電機器イミュニティ_直流入力ポートリップル印加","直流入力ポートリップル印加","Ripple oc D.C. input power port immunity test","","イミ_電力送電機器イミュニティ",3,103,"","直流入力ポートリップル印加"]
["電源高調波","電源高調波","Harmonic current","","試験区分",1,104,"","7．試験区分－電源高調波"]
["電源高調波_電源高調波歪","電源高調波歪","Mains harmonic current distortion","","電源高調波",2,105,"","7.1．電源高調波歪"]
["電源高調波_電源高調波歪_高調波電流","高調波電流試験(IEC61000-4-11/EN61000-4-11)","Harmonic current test","","電源高調波_電源高調波歪",3,106,"","高調波電流試験"]
["電源高調波_電源電圧動揺","電源電圧動揺・フリッカー試験(IEC61000-3-2)","Power voltage variation","","電源高調波",2,107,"","7.2．電源電圧動揺"]
["電源高調波_電源電圧動揺_フリッカー","フリッカー試験(IEC61000-3-2)","Flicker test","","電源高調波_電源電圧動揺",3,108,"","フリッカー試験"]
["音響","音響","Acoustics","","試験区分",1,109,"","8．試験区分－音響"]
["音響_空気伝搬騒音","空気伝搬騒音","Airborne noise","","音響",2,110,"","8.1．空気伝搬騒音"]
["音響_空気伝搬騒音_空気伝搬騒音","空気伝搬騒音試験","Airborne noise emission test","","音響_空気伝搬騒音",3,111,"","空気伝搬騒音試験（付属書：VF154）"]
["通信機器性能","通信機器性能","Telecommunication equipment performance","","試験区分",1,112,"","9．試験区分－通信機器性能 １"]
["通信機器性能_送信電力","送信電力","Transmission power","","通信機器性能",2,113,"","9.1．送信電力"]
["通信機器性能_送信電力_アンテナ端子出力電力","アンテナ端子出力電力","Antenna terminal output power","","通信機器性能_送信電力",3,114,"","アンテナ端子出力電力"]
["通信機器性能_送信電力_アンテナ端子出力電力_EIA_TIA_603_C","EIA/TIA-603-C","EIA/TIA-603-C","","通信機器性能_送信電力_アンテナ端子出力電力",4,115,"","EIA/TIA-603-C"]
["通信機器性能_送信電力_アンテナ端子出力電力_FCC_Part2","FCC_Part2","FCC_Part2","","通信機器性能_送信電力_アンテナ端子出力電力",4,116,"","FCC Part2(2.1046)"]
["通信機器性能_送信電力_放射電力_置換","放射電力(置換)","Radiated power (substitution method)","","通信機器性能_送信電力",3,117,"","放射電力(置換)"]
["通信機器性能_送信電力_放射電力_置換_EIA_TIA_603_C","EIA/TIA-603-C","EIA/TIA-603-C","","通信機器性能_送信電力_放射電力_置換",4,118,"","EIA/TIA-603-C"]
["通信機器性能_送信電力_放射電力_置換_FCC_Part2","FCC_Part2","FCC_Part2","","通信機器性能_送信電力_放射電力_置換",4,119,"","FCC Part2(2.1053)"]
["通信機器性能_送信電力_放射電力_置換_ANSI","ANSI","ANSI","","通信機器性能_送信電力_放射電力_置換",4,120,"***申請書上から削除済み***","-"]
["通信機器性能_スプリアス","スプリアス","Signal spurious","","通信機器性能",2,121,"","9.2．スプリアス"]
["通信機器性能_スプリアス_端子電圧","端子電圧(キャリア比)","Terminal voltage (carrier ratio)","","通信機器性能_スプリアス",3,122,"","端子電圧（キャリア比）"]
["通信機器性能_スプリアス_端子電圧_EIA_TIA_603_C","EIA_TIA_603_C","EIA_TIA_603_C","","通信機器性能_スプリアス_端子電圧",4,123,"","EIA/TIA-603-C"]
["通信機器性能_スプリアス_端子電圧_FCC_Part2","FCC_Part2","FCC_Part2","","通信機器性能_スプリアス_端子電圧",4,124,"","FCC Part2(2.1051)"]
["通信機器性能_スプリアス_放射電界強度","放射電界強度","Radiated electric field strength","","通信機器性能_スプリアス",3,125,"","放射電界強度"]
["通信機器性能_スプリアス_放射電界強度_EIA_TIA_603_C","EIA/TIA-603-C","EIA/TIA-603-C","","通信機器性能_スプリアス_放射電界強度",4,126,"","EIA/TIA-603-C"]
["通信機器性能_スプリアス_放射電界強度_FCC_Part2","FCC_Part2","FCC_Part2","","通信機器性能_スプリアス_放射電界強度",4,127,"","FCC Part2(2.1053)"]
["通信機器性能_スプリアス_放射電界強度_ANSI","ANSI","ANSI","","通信機器性能_スプリアス_放射電界強度",4,128,"***申請書上から削除済み***","-"]
["通信機器性能_信号特性","信号特性","Signal characteristics","","通信機器性能",2,129,"","9.3．信号特性"]
["通信機器性能_信号特性_周波数安定度","周波数安定度","Frequency stability","","通信機器性能_信号特性",3,130,"","周波数安定度"]
["通信機器性能_信号特性_周波数安定度_EIA_TIA_603_C","EIA/TIA-603-C","EIA/TIA-603-C","","通信機器性能_信号特性_周波数安定度",4,131,"","EIA/TIA-603-C"]
["通信機器性能_信号特性_周波数安定度_FCC_Part2","FCC_Part2","FCC_Part2","","通信機器性能_信号特性_周波数安定度",4,132,"","FCC Part2(2.1055)"]
["通信機器性能_信号特性_変調特性","変調特性","Modulation characteristics","","通信機器性能_信号特性",3,133,"","変調特性"]
["通信機器性能_信号特性_変調特性_EIA_TIA_603_C","EIA/TIA-603-C","EIA/TIA-603-C","","通信機器性能_信号特性_変調特性",4,134,"","EIA/TIA-603-C"]
["通信機器性能_信号特性_変調特性_FCC_Part2","FCC_Part2","FCC_Part2","","通信機器性能_信号特性_変調特性",4,135,"","FCC Part2(2.1047)"]
["通信機器性能_信号特性_占有帯域幅","占有帯域幅","Occupied band width (OBW)","","通信機器性能_信号特性",3,136,"","占有帯域幅"]
["通信機器性能_信号特性_占有帯域幅_EIA_TIA_603_C","EIA/TIA-603-C","EIA/TIA-603-C","","通信機器性能_信号特性_占有帯域幅",4,137,"","EIA/TIA-603-C"]
["通信機器性能_信号特性_占有帯域幅_FCC_Part2","FCC_Part2","FCC_Part2","","通信機器性能_信号特性_占有帯域幅",4,138,"","FCC Part2(2.1049)"]
["通信機器性能_信号特性_スペクトラム","スペクトラム","Signal spectrum","","通信機器性能_信号特性",3,139,"","スペクトラム"]
["通信機器性能_信号特性_スペクトラム_EIA_TIA_603_C","EIA/TIA-603-C","EIA/TIA-603-C","","通信機器性能_信号特性_スペクトラム",4,140,"","EIA/TIA-603-C"]
["通信機器性能_信号特性_スペクトラム_FCC_Part2","FCC_Part2","FCC_Part2","","通信機器性能_信号特性_スペクトラム",4,141,"","FCC Part2(2.1057)"]
["通信機器性能_その他","その他(FCC15)","Others(FCC15)","","通信機器性能",2,142,"","9.4．その他(FCC15)"]
["通信機器性能_その他_動作周波数","動作周波数","Operational frequency","","通信機器性能_その他",3,143,"","動作周波数"]
["通信機器性能_その他_動作周波数_ANSI_63_4_2003","ANSI C63.4","ANSI C63.4","","通信機器性能_その他_動作周波数",4,144,"***申請書上から削除済み***","-"]
["通信機器性能_その他_動作周波数_ANSI_63_10","ANSI C63.10","ANSI C63.10","","通信機器性能_その他_動作周波数",4,145,"","ANSI C63.10"]
["通信機器性能_その他_動作周波数_FCC_Part15_C","FCC_Part15C","FCC_Part15C","","通信機器性能_その他_動作周波数",4,146,"","FCC Part15C"]
["通信機器性能_その他_周波数安定度","周波数安定度","Frequency stability","","通信機器性能_その他",3,147,"","周波数安定度"]
["通信機器性能_その他_周波数安定度_ANSI_63_4_2003","ANSI C63.4","ANSI C63.4","","通信機器性能_その他_周波数安定度",4,148,"***申請書上から削除済み***","-"]
["通信機器性能_その他_周波数安定度_ANSI_63_10","ANSI C63.10","ANSI C63.10","","通信機器性能_その他_周波数安定度",4,149,"","ANSI C63.10"]
["通信機器性能_その他_周波数安定度_FCC_Part15_C","FCC_Part15C","FCC_Part15C","","通信機器性能_その他_周波数安定度",4,150,"","FCC Part15C"]
["通信機器性能_その他_入力電圧","入力電圧","Input voltage","","通信機器性能_その他",3,151,"","入力電圧"]
["通信機器性能_その他_入力電圧_ANSI_63_4_2003","ANSI C63.4","ANSI C63.4","","通信機器性能_その他_入力電圧",4,152,"***申請書上から削除済み***","-"]
["通信機器性能_その他_入力電圧_ANSI_63_10","ANSI C63.10","ANSI C63.10","","通信機器性能_その他_入力電圧",4,153,"","ANSI C63.10"]
["通信機器性能_その他_入力電圧_FCC_Part15_C","FCC_Part15C","FCC_Part15C","","通信機器性能_その他_入力電圧",4,154,"","FCC Part15C"]
["通信機器性能_その他_チャンネル占有","チャンネル占有","Channel occupancy rate","","通信機器性能_その他",3,155,"","チャンネル占有"]
["通信機器性能_その他_チャンネル占有_ANSI_63_4_2003","ANSI C63.4","ANSI C63.4","","通信機器性能_その他_チャンネル占有",4,156,"***申請書上から削除済み***","-"]
["通信機器性能_その他_チャンネル占有_ANSI_63_10","ANSI C63.10","ANSI C63.10","","通信機器性能_その他_チャンネル占有",4,157,"","ANSI C63.10"]
["通信機器性能_その他_チャンネル占有_FCC_Part15_C","FCC Part15C","FCC Part15C","","通信機器性能_その他_チャンネル占有",4,158,"","FCC Part15C"]
["通信機器性能_その他_スペクトラム密度","スペクトラム密度","Spectrum density","","通信機器性能_その他",3,159,"","スペクトラム密度"]
["通信機器性能_その他_スペクトラム密度_ANSI_63_4_2003","ANSI C63.4","ANSI C63.4","","通信機器性能_その他_スペクトラム密度",4,160,"***申請書上から削除済み***","-"]
["通信機器性能_その他_スペクトラム密度_ANSI_63_10","ANSI C63.10","ANSI C63.10","","通信機器性能_その他_スペクトラム密度",4,161,"","ANSI C63.10"]
["通信機器性能_その他_スペクトラム密度_FCC_Part15_C","FCC Part15C","FCC Part15C","","通信機器性能_その他_スペクトラム密度",4,162,"","FCC Part15C"]
["通信機器性能_その他_アンテナ端子出力電圧","アンテナ端子出力電圧","Antenna terminal output voltage","","通信機器性能_その他",3,163,"","アンテナ端子出力電圧"]
["通信機器性能_その他_アンテナ端子出力電圧_ANSI_63_4_2003","ANSI C63.4","ANSI C63.4","","通信機器性能_その他_アンテナ端子出力電圧",4,164,"***申請書上から削除済み***","-"]
["通信機器性能_その他_アンテナ端子出力電圧_ANSI_63_10","ANSI C63.10","ANSI C63.10","","通信機器性能_その他_アンテナ端子出力電圧",4,165,"","ANSI C63.10"]
["通信機器性能_その他_アンテナ端子出力電圧_ANSI_63_17_1998","ANSI C63.17:1998","ANSI C63.17:1998","","通信機器性能_その他_アンテナ端子出力電圧",4,166,"","ANSI C63.17:1998"]
["通信機器性能_その他_アンテナ端子出力電圧_FCC_Part15_C","FCC Part15C","FCC Part15C","","通信機器性能_その他_アンテナ端子出力電圧",4,167,"","FCC Part15C"]
["通信機器性能_その他_尖頭伝導送信出力","尖頭伝導送信出力","Peak transmitter output power","","通信機器性能_その他",3,168,"","尖頭伝導送信出力"]
["通信機器性能_その他_尖頭伝導送信出力_ANSI_63_4_2003","ANSI C63.4","ANSI C63.4","","通信機器性能_その他_尖頭伝導送信出力",4,169,"***申請書上から削除済み***","-"]
["通信機器性能_その他_尖頭伝導送信出力_ANSI_63_10","ANSI C63.10","ANSI C63.10","","通信機器性能_その他_尖頭伝導送信出力",4,170,"","ANSI C63.10"]
["通信機器性能_その他_尖頭伝導送信出力_FCC_Part15_E","FCC_Part15E","FCC_Part15E","","通信機器性能_その他_尖頭伝導送信出力",4,171,"","FCC Part15E"]
["通信機器性能_その他_放射帯域幅","放射帯域幅","Emission Band width","","通信機器性能_その他",3,172,"","放射帯域幅"]
["通信機器性能_その他_放射帯域幅_ANSI_63_4_2003","ANSI C63.4","ANSI C63.4","","通信機器性能_その他_放射帯域幅",4,173,"***申請書上から削除済み***","-"]
["通信機器性能_その他_放射帯域幅_ANSI_63_10","ANSI C63.10","ANSI C63.10","","通信機器性能_その他_放射帯域幅",4,174,"","ANSI C63.10"]
["通信機器性能_その他_放射帯域幅_FCC_Part15_E","FCC_Part15E","FCC_Part15E","","通信機器性能_その他_放射帯域幅",4,175,"","FCC Part15E"]
["通信機器性能_その他_尖頭電力スペクトラム密度","尖頭電力スペクトラム密度","Peak power spectrum power","","通信機器性能_その他",3,176,"","尖頭電力スペクトラム密度"]
["通信機器性能_その他_尖頭電力スペクトラム密度_ANSI_63_4_2003","ANSI C63.4","ANSI C63.4","","通信機器性能_その他_尖頭電力スペクトラム密度",4,177,"***申請書上から削除済み***","-"]
["通信機器性能_その他_尖頭電力スペクトラム密度_ANSI_63_10","ANSI C63.10","ANSI C63.10","","通信機器性能_その他_尖頭電力スペクトラム密度",4,178,"","ANSI C63.10"]
["通信機器性能_その他_尖頭電力スペクトラム密度_FCC_Part15_E","FCC_Part15E","FCC_Part15E","","通信機器性能_その他_尖頭電力スペクトラム密度",4,179,"","FCC Part15E"]
["通信機器性能_その他_最大偏位","最大偏位","Maximum variations","","通信機器性能_その他",3,180,"","最大偏位"]
["通信機器性能_その他_最大偏位_ANSI_63_4_2003","ANSI C63.4","ANSI C63.4","","通信機器性能_その他_最大偏位",4,181,"***申請書上から削除済み***","-"]
["通信機器性能_その他_最大偏位_ANSI_63_10","ANSI C63.10","ANSI C63.10","","通信機器性能_その他_最大偏位",4,182,"","ANSI C63.10"]
["通信機器性能_その他_最大偏位_FCC_Part15_E","FCC_Part15E","FCC_Part15E","","通信機器性能_その他_最大偏位",4,183,"","FCC Part15E"]
["通信機器性能_上記以外の試験","8.5 上記以外の試験","Test other than 8.5","","通信機器性能",2,184,"","9.5．上記以外の試験"]
["通信機器性能_上記以外の試験_欧州","欧州規格に基づく試験","Based on European standards","","通信機器性能_上記以外の試験",3,185,"","欧州規格に基づく試験"]
["通信機器性能_上記以外の試験_カナダ","カナダ規格に基づく試験","Based on Canadian standards","","通信機器性能_上記以外の試験",3,186,"","カナダ規格に基づく試験"]
["通信機器性能2","10. 通信機器性能 2","10 Telecommunication equipment performance 2","","試験区分",1,187,"","10．試験区分－通信機器性能 ２"]
["通信機器性能2_電磁界ばく露","電磁界ばく露","Exposure to electric, magnetic, and electromagnetic fields","","通信機器性能2",2,188,"","10.1．電磁界ばく露"]
["通信機器性能2_電磁界ばく露_局所比吸収率","局所比吸収率","SAR","","通信機器性能2_電磁界ばく露",3,189,"","局所吸収率 (付属書：VF119)"]
["通信機器性能2_電磁界ばく露_磁界強度_磁界プローブ","磁界強度(磁界プローブ)","Magnetic field strength (Magnetic probe)","","通信機器性能2_電磁界ばく露",3,190,"","磁界強度（磁界プローブ）"]
["通信機器性能2_電磁界ばく露_低周波磁界密度_等方性プローブ","電界強度（電界プローブ）","Electric field strength (Electric field probe)","","通信機器性能2_電磁界ばく露",3,191,"","電界強度（電界プローブ）"]
["通信機器性能3","11 通信機器性能 3","11. Telecommunication equipment performance 3","","試験区分",1,192,"","11．試験区分－通信機器性能 ３"]
["通信機器性能3_有線通信機器","有線通信機器","Wire communication equipment","","通信機器性能3",2,193,"","11.1．公衆回線接続通信端末機器試験"]
["環境","12. 環境（消費電力）","12. Environment (Power consumption)","","試験区分",1,194,"","12．試験区分－環境（消費電力）（注：本項を申請する場合は、事前にVLACにご相談ください。）"]
["環境_消費電力","消費電力","Power consumption","","環境",2,195,"","12.1．消費電力"]
["環境_消費電力_標準消費電力量_TEC法","標準消費電力量_TEC法","Standard power consumption level_TEC method","","環境_消費電力",3,196,"","標準消費電力量 (TEC)法"]
["環境_消費電力_動作モード_OM法","動作モード_OM法","Operation method_OM method","","環境_消費電力",3,197,"","動作モード (OM)法"]
["環境_消費電力_家庭用電気冷蔵庫及び電気冷凍庫の特性及び試験","家庭用電気冷蔵庫及び電気冷凍庫の特性及び試験","Household refrigerating appliances - Characteristics and test methods","","環境_消費電力",3,198,"","家庭用電気冷蔵庫及び電気冷凍庫の特性及び試験"]
["製品安全","13. 製品安全","13. Products safety","","試験区分",1,199,"","13．試験区分－製品安全試験（注：本項を申請する場合は、事前にVLACにご相談ください。）"]
["製品安全_IEC","IEC製品安全規定に基づく耐電圧試験及び漏れ電流測定","Withstand voltage test and leakage current measurement based on IEC products safety standards","","製品安全",2,200,"","13.1．製品安全試験"]
["製品安全_IEC_家電製品","家電製品","Household appliances","","製品安全_IEC",3,201,"","家電製品"]
["製品安全_IEC_IT機器","IT機器","IT Equipment","","製品安全_IEC",3,202,"","IT機器"]
["製品安全_IEC_AV機器","AV機器","AV Equipment","","製品安全_IEC",3,203,"","AV機器"]
["製品安全_IEC_医用電気機器","医用電気機器","Medical electrical equipment","","製品安全_IEC",3,204,"","医用電気機器"]
["製品安全_IEC_制御機器計測機器","制御機器・計測機器","Electrical equipment for measurement ,control and laboratory use","","製品安全_IEC",3,205,"","制御機器・計測機器"]

{"sheet":"試験規格マスタ","index":14,"n_rows":515,"n_cols":8,"rows_kept":515,"hidden":true}
["試験規格コード","試験規格名称","試験規格名称英語","親試験規格コード","階層","表示順","備考","申請書名称"]
["エミッション","エミッション試験","Emission test","試験規格",1,1,null,"14．試験規格－電磁両立性エミッション"]
["エミッション_VCCI技術基準V-3","VCCI技術基準V-3","V-3：VCCI Technical Requirement","エミッション",2,2,null,"VCCI技術基準 V-3"]
["エミッション_FCC_Part15B","FCC Part15B","FCC Part15B","エミッション",2,3,null,"FCC Part15B　この項にチェックする場合は、申請書の【英文名称入力】シートを入力して下さい。"]
["エミッション_FCC_Part15B_SubB_情報処理装置等","Subpart B 情報処理装置等、非意図放射機器試験","Subpart B Unintentional radiators","エミッション_FCC_Part15B",3,4,null,"Subpart B ITE等、非意図放射機器試験"]
["エミッション_FCC_Part15B_SubB_情報処理装置等_ANSI_63_4_2003","ANSI C63.4:2003","ANSI C63.4:2003","エミッション_FCC_Part15B",3,5,null,"ANSI C63.4-2003"]
["エミッション_FCC_Part15B_SubB_情報処理装置等_ANSI_63_4_2009","ANSI C63.4:2009","ANSI C63.4:2009","エミッション_FCC_Part15B",3,6,null,"ANSI C63.4-2009"]
["エミッション_FCC_Part15B_SubB_情報処理装置等_ANSI_63_4_2014","ANSI C63.4:2014","ANSI C63.4:2014","エミッション_FCC_Part15B",3,7,null,"ANSI C63.4-2014"]
["エミッション_FCC_Part15B_SubB_放送受信機試験","Subpart B 放送受信機試験","Subpart B Broadcast receiver","エミッション_FCC_Part15B",3,8,null,"Subpart B放送受信機試験"]
["エミッション_FCC_Part15B_SubB_放送受信機試験_放送受信","放送受信(MP-2を含む)","Broadcast receivers, including MP-2","エミッション_FCC_Part15B",3,9,null,"ANSI C63.4に基づく放送受信(MP-2を含む)"]
["エミッション_FCC_Part15B_SubB_放送受信機試験_他の受信機","他の受信機","Other receivers","エミッション_FCC_Part15B",3,10,null,"他の受信機"]
["エミッション_FCC_Part18","FCC_Part18","FCC_Part18","エミッション",2,11,null,"FCC Part18 (MP-5)　この項にチェックする場合は、申請書の【英文名称入力】シートを入力して下さい。"]
["エミッション_CISPR11","CISPR11","CISPR11","エミッション",2,12,null,"CISPR11"]
["エミッション_CISPR12","CISPR12","CISPR12","エミッション",2,13,null,"CISPR12"]
["エミッション_CISPR13","CISPR13","CISPR13","エミッション",2,14,null,"CISPR13"]
["エミッション_CISPR14-1","CISPR14-1","CISPR14-1","エミッション",2,15,null,"CISPR14-1"]
["エミッション_CISPR15","CISPR15","CISPR15","エミッション",2,16,null,"CISPR15"]
["エミッション_CISPR22","CISPR22","CISPR22","エミッション",2,17,null,"CISPR22"]
["エミッション_CISPR25","CISPR25","CISPR25","エミッション",2,18,null,"CISPR25"]
["エミッション_CISPR32","CISPR32","CISPR32","エミッション",2,19,null,"CISPR32"]
["エミッション_EN55011","EN55011","EN55011","エミッション",2,20,null,"EN55011"]
["エミッション_EN55012","EN55012","EN55012","エミッション",2,21,null,"EN55012"]
["エミッション_EN55013","EN55013","EN55013","エミッション",2,22,null,"EN55013"]
["エミッション_EN55014-1","EN55014-1","EN55014-1","エミッション",2,23,null,"EN55014-1"]
["エミッション_EN55015","EN55015","EN55015","エミッション",2,24,null,"EN55015"]
["エミッション_EN55022","EN55022","EN55022","エミッション",2,25,null,"EN55022"]
["エミッション_EN55025","EN55025","EN55025","エミッション",2,26,null,"EN55025"]
["エミッション_EN55032","EN55032","EN55032","エミッション",2,27,null,"EN55032"]
["エミッション_EN55103-1","EN55103-1","EN55103-1","エミッション",2,28,null,"EN55103-1"]
["エミッション_IEC61800-3","IEC61800-3","IEC61800-3","エミッション",2,29,null,"IEC61800-3"]
["エミッション_EN61800-3","EN61800-3","EN61800-3","エミッション",2,30,null,"EN61800-3"]
["エミッション_ISO22199","ISO22199","ISO22199","エミッション",2,31,null,"ISO22199"]
["エミッション_電気用品の雑音の強さの測定方法","エミッション_電気用品の雑音の強さの測定方法","Emission_Clause 1 of Ministerial Ordinance","エミッション",2,32,null,"電気用品の雑音の強さの測定方法"]
["エミッション_電気用品の雑音の強さの測定方法_2章","2章","Chapter 2","エミッション",2,33,null,"2章"]
["エミッション_電気用品の雑音の強さの測定方法_3章","3章","Chapter 3","エミッション",2,34,null,"3章"]
["エミッション_電気用品の雑音の強さの測定方法_4章","4章","Chapter 4","エミッション",2,35,null,"4章"]
["エミッション_電気用品の雑音の強さの測定方法_5章","5章","Chapter 5","エミッション",2,36,null,"5章"]
["エミッション_電気用品の雑音の強さの測定方法_6章","6章","Chapter 6","エミッション",2,37,null,"6章"]
["エミッション_電気用品の雑音の強さの測定方法_7章","7章","Chapter 7","エミッション",2,38,null,"7章"]
["エミッション_電気用品の雑音の強さの測定方法_8章","8章","Chapter 8","エミッション",2,39,null,"8章"]
["エミッション_電気用品の雑音の強さの測定方法_9章","9章","Chapter 9","エミッション",2,40,null,"9章"]
["エミッション_J55001","J55001","J55001","エミッション",2,41,null,"J55001"]
["エミッション_J55011","J55011","J55011","エミッション",2,42,"***申請書上から削除済み***","-"]
["エミッション_J55013","J55013","J55013","エミッション",2,43,null,"J55013"]
["エミッション_J55014-1","J55014-1","J55014-1","エミッション",2,44,null,"J55014-1"]
["エミッション_J55015","J55015","J55015","エミッション",2,45,null,"J55015"]
["エミッション_J55022","J55022","J55022","エミッション",2,46,null,"J55022"]
["エミッション_J55032","J55032","J55032","エミッション",2,47,"Excelは有版、無版を用意し納品済み","J55032"]
["エミッション_電波法施行規則","電波法施行規則","Enforcement rule of Radio Law：Article 46.7 (Microwave Oven or IH Cooking Heater)","エミッション",2,48,null,"電波法施行規則"]
["エミッション_電波法施行規則_電波法第46条の2の5","電波法第46条の2の5","Enforcement rule of Radio Law：Article 46.2.5 (Broad band electric power line carrier communication facility) / Ministry of Public Management, Home Affairs, Posts and Telecommunications notification No.520(H18.10.4)","エミッション_電波法施行規則",3,49,null,"第四十六条の二の五（広帯域電力線搬送通信設備）"]
["エミッション_電波法施行規則_電波法第46条の7","電波法第46条の7","Enforcement rule of Radio Law：Article 46.7","エミッション_電波法施行規則",3,50,null,"第四十六条の七（電子レンジ又は電磁誘導加熱式調理器）"]
["エミッション_AS_NZS_CISPR11","AS/NZS_CISPR11","AS/NZS_CISPR11","エミッション",2,51,null,"AS/NZS CISPR11"]
["エミッション_AS_NZS_CISPR12","AS/NZS_CISPR12","AS/NZS_CISPR12","エミッション",2,52,null,"AS/NZS CISPR12"]
["エミッション_AS_NZS_CISPR13","AS/NZS_CISPR13","AS/NZS_CISPR13","エミッション",2,53,null,"AS/NZS CISPR13"]
["エミッション_AS_NZS_CISPR14-1","AS/NZS_CISPR14-1","AS/NZS_CISPR14-1","エミッション",2,54,null,"AS/NZS CISPR14.1"]
["エミッション_AS_NZS_CISPR15","AS/NZS_CISPR15","AS/NZS_CISPR15","エミッション",2,55,null,"AS/NZS CISPR15"]
["エミッション_AS_NZS_CISPR22","AS/NZS_CISPR22","AS/NZS_CISPR22","エミッション",2,56,null,"AS/NZS CISPR22"]
["エミッション_AS_NZS_CISPR25","AS/NZS_CISPR25","AS/NZS_CISPR25","エミッション",2,57,null,"AS/NZS CISPR25"]
["エミッション_AS_NZS_CISPR32","AS/NZS_CISPR32","AS/NZS_CISPR32","エミッション",2,58,null,"AS/NZS CISPR32"]
["エミッション_AS_NZS_3200-1-2","AS/NZS_3200-1-2","AS/NZS_3200-1-2","エミッション",2,59,null,"AS/NZS 3200.1.2"]
["エミッション_AS_NZS_61000-6-3","AS/NZS_61000-6-3","AS/NZS_61000-6-3","エミッション",2,60,null,"AS/NZS 61000.6.3"]
["エミッション_AS_NZS_61000-6-4","AS/NZS_61000-6-4","AS/NZS_61000-6-4","エミッション",2,61,null,"AS/NZS 61000.6.4"]
["エミッション_IEC61131-2","IEC61131-2","IEC61131-2","エミッション",2,62,null,"IEC 61131-2"]
["エミッション_EN61131-2","EN61131-2","EN61131-2","エミッション",2,63,null,"EN 61131-2"]
["エミッション_ICES-001","ICES-001","ICES-001","エミッション",2,64,null,"ICES-001"]
["エミッション_ICES-002","ICES-002","ICES-002","エミッション",2,65,null,"ICES-002"]
["エミッション_ICES-003","ICES-003","ICES-003","エミッション",2,66,null,"ICES-003"]
["エミッション_ICES-005","ICES-005","ICES-005","エミッション",2,67,null,"ICES-005"]
["エミッション_BETS-7","BETS-7","BETS-7","エミッション",2,68,null,"BETS-7"]
["エミッション_CNS13803","CNS13803","CNS13803","エミッション",2,69,null,"CNS 13803"]
["エミッション_CNS13439","CNS13439","CNS13439","エミッション",2,70,null,"CNS 13439"]
["エミッション_CNS13438","CNS13438","CNS13438","エミッション",2,71,null,"CNS 13438"]
["エミッション_CNS13783-1","CNS13783-1","CNS13783-1","エミッション",2,72,null,"CNS 13783-1"]
["エミッション_CNS14115","CNS14115","CNS14115","エミッション",2,73,null,"CNS 14115"]
["エミッション_K00013","K00013","K00013","エミッション",2,74,null,"K00013"]
["エミッション_K00014-1","K00014-1","K00014-1","エミッション",2,75,null,"K00014-1"]
["エミッション_K00015","K00015","K00015","エミッション",2,76,null,"K00015"]
["エミッション_KN15","KN15","KN15","エミッション",2,77,null,"KN15"]
["エミッション_K00022","K00022","K00022","エミッション",2,78,null,"K00022"]
["エミッション_KN22","KN22","KN22","エミッション",2,79,null,"KN22  "]
["エミッション_GB13837","GB13837","GB13837","エミッション",2,80,null,"GB13837"]
["エミッション_GB4343_1","GB4343.1","GB4343.1","エミッション",2,81,null,"GB4343.1"]
["エミッション_GB9254","GB9254","GB9254","エミッション",2,82,null,"GB9254"]
["エミッション_GB17743","GB17743","GB17743","エミッション",2,83,null,"GB 17743"]
["エミッション_GOST_R51318_13","GOST.R51318.13","GOST.R51318.13","エミッション",2,84,null,"GOST R51318.13"]
["エミッション_GOST_R51318_14_1","GOST.R51318.14.1","GOST.R51318.14.1","エミッション",2,85,null,"GOST R51318.14.1"]
["エミッション_GOST_R51318_15","GOST.R51318.15","GOST.R51318.15","エミッション",2,86,null,"GOST R51318.15"]
["エミッション_GOST_R51318_22","GOST.R51318.22","GOST.R51318.22","エミッション",2,87,null,"GOST R51318.22"]
["エミッション_IEC61000-6-3","IEC61000-6-3","IEC61000-6-3","エミッション",2,88,null,"IEC61000-6-3"]
["エミッション_IEC61000-6-4","IEC61000-6-4","IEC61000-6-4","エミッション",2,89,null,"IEC61000-6-4"]
["エミッション_EN61000-6-3","EN61000-6-3","EN61000-6-3","エミッション",2,90,null,"EN61000-6-3"]
["エミッション_EN61000-6-4","EN61000-6-4","EN61000-6-4","エミッション",2,91,null,"EN61000-6-4"]
["エミッション_EN12015","EN12015","EN12015","エミッション",2,92,null,"EN12015"]
["エミッション_IEC60533","IEC60533","IEC60533","エミッション",2,93,null,"IEC 60533"]
["エミッション_EN60533","EN60533","EN60533","エミッション",2,94,null,"EN 60533"]
["エミッション_IEC60945","IEC60945","IEC60945","エミッション",2,95,null,"IEC 60945"]
["エミッション_EN60945","EN60945","EN60945","エミッション",2,96,null,"EN 60945"]
["エミッション_EN13309","EN13309","EN13309","エミッション",2,97,null,"EN13309"]
["エミッション_IEC62236-3-2","IEC62236-3-2","IEC62236-3-2","エミッション",2,98,null,"IEC62236-3-2"]
["エミッション_EN50121-3-2","EN50121-3-2","EN50121-3-2","エミッション",2,99,null,"EN50121-3-2"]
["エミッション_IEC62236-4","IEC62236-4","IEC62236-4","エミッション",2,100,null,"IEC62236-4"]
["エミッション_EN50121-4","EN50121-4","EN50121-4","エミッション",2,101,null,"EN50121-4"]
["エミッション_日本海事協会規格第7編1章","日本海事協会規格（船用材料機器）第7編1章","Nippon Kaiji Kyokai Technical rule of Materials and Equipment for Marine Use : Article 7 Chapter 1\n（Rules for the Automatic and Remote control）","エミッション",2,102,null,"日本海事協会規格(船用材料機器)第７編１章（自動化機器および装置）"]
["エミッション_ICAS_E10","ICAS E10","ICAS E10","エミッション",2,103,null,"ICAS E10"]
["エミッション_IEC61326-1","IEC61326-1","IEC61326-1","エミッション",2,104,null,"IEC61326-1(製品個別要求条件IEC61326-2シリーズ)*"]
["エミッション_EN61326-1","EN61326-1","EN61326-1","エミッション",2,105,null,"EN61326-1(製品個別要求条件IEC61326-2シリーズ)*"]
["エミッション_IEC60601-1-2","IEC60601-1-2","IEC60601-1-2","エミッション",2,106,null,"IEC60601-1-2(製品個別要求条件IEC60601-2シリーズ)*"]
["エミッション_EN60601-1-2","EN60601-1-2","EN60601-1-2","エミッション",2,107,null,"EN60601-1-2(製品個別要求条件EN60601-2シリーズ)*"]
["エミッション_JIS_C1806-1","JIS C1806-1","JIS C1806-1","エミッション",2,108,null,"JIS C1806-1"]
["エミッション_JIS_T0601-1-2","JIS T0601-1-2","JIS T0601-1-2","エミッション",2,109,null,"JIS T0601-1-2(製品個別要求条件JIS T0601-2シリーズ)*"]
["エミッション_CISPR 13","CISPR 13","CISPR 13","エミッション",2,110,"***申請書上から削除済み***","-"]
["エミッション_EN 55013","EN 55013","EN 55013","エミッション",2,111,"***申請書上から削除済み***","-"]
["エミッション_AS/NZS CISPR 13","AS/NZS CISPR 13","AS/NZS CISPR 13","エミッション",2,112,"***申請書上から削除済み***","-"]
["エミッション_TCVN 7492-1","TCVN 7492-1","TCVN 7492-1","エミッション",2,113,"***申請書上から削除済み***","-"]
["エミッション_EN 62040-2","EN 62040-2","EN 62040-2","エミッション",2,114,"***申請書上から削除済み***","-"]
["エミッション_IEC 62040-2","IEC 62040-2","IEC 62040-2","エミッション",2,115,"***申請書上から削除済み***","-"]
["エミッション_JIS C 4411-2","JIS C 4411-2","JIS C 4411-2","エミッション",2,116,"***申請書上から削除済み***","-"]
["エミッション_JIS C4411-2","JIS C4411-2","JIS C4411-2","エミッション",2,117,"***申請書上から削除済み***","-"]
["エミッション_FCC Part 15 Subpart B,  MP-2","FCC Part 15 Subpart B,  MP-2","FCC Part 15 Subpart B,  MP-2","エミッション",2,118,"***申請書上から削除済み***","-"]
["エミッション_FCC Part 18,MP-5 ","FCC Part 18,MP-5 ","FCC Part 18,MP-5 ","エミッション",2,119,"***申請書上から削除済み***","-"]
["エミッション_ANSI C63.10","ANSI C63.10","ANSI C63.10","エミッション",2,120,"***申請書上から削除済み***","-"]
["エミッション_AS/NZS CISPR13","AS/NZS CISPR13","AS/NZS CISPR13","エミッション",2,121,"***申請書上から削除済み***","-"]
["エミッション_IEC61326-2-1","IEC61326-2-1","IEC61326-2-1","エミッション",2,122,"***申請書上から削除済み***","-"]
["エミッション_EN 61326-2-1","EN 61326-2-1","EN 61326-2-1","エミッション",2,123,"***申請書上から削除済み***","-"]
["エミッション_IEC 61326-2-2","IEC 61326-2-2","IEC 61326-2-2","エミッション",2,124,"***申請書上から削除済み***","-"]
["エミッション_EN 61326-2-2","EN 61326-2-2","EN 61326-2-2","エミッション",2,125,"***申請書上から削除済み***","-"]
["エミッション_IEC61326-2-6","IEC61326-2-6","IEC61326-2-6","エミッション",2,126,"***申請書上から削除済み***","-"]
["エミッション_EN 61326-2-6","EN 61326-2-6","EN 61326-2-6","エミッション",2,127,"***申請書上から削除済み***","-"]
["エミッション_EN 50121-5","EN 50121-5","EN 50121-5","エミッション",2,128,"***申請書上から削除済み***","-"]
["エミッション_IEC 62236-5","IEC 62236-5","IEC 62236-5","エミッション",2,129,"***申請書上から削除済み***","-"]
["エミッション_IEC61851-21","IEC61851-21","IEC61851-21","エミッション",2,130,"***申請書上から削除済み***","-"]
["エミッション_EN 61851-21","EN 61851-21","EN 61851-21","エミッション",2,131,"***申請書上から削除済み***","-"]
["エミッション_IEC62040-2","IEC62040-2","IEC62040-2","エミッション",2,132,"***申請書上から削除済み***","-"]
["エミッション_CISPR16-1-2","CISPR16-1-2","CISPR16-1-2","エミッション",2,133,"***申請書上から削除済み***","-"]
["エミッション_CISPR16-1-3","CISPR16-1-3","CISPR16-1-3","エミッション",2,134,"***申請書上から削除済み***","-"]
["エミッション_CISPR16-1-4","CISPR16-1-4","CISPR16-1-4","エミッション",2,135,"***申請書上から削除済み***","-"]
["エミッション_CISPR16-2-1","CISPR16-2-1","CISPR16-2-1","エミッション",2,136,"***申請書上から削除済み***","-"]
["エミッション_CISPR16-2-2","CISPR16-2-2","CISPR16-2-2","エミッション",2,137,"***申請書上から削除済み***","-"]
["エミッション_CISPR16-2-3","CISPR16-2-3","CISPR16-2-3","エミッション",2,138,"***申請書上から削除済み***","-"]
["エミッション_CISPR16-2-5","CISPR16-2-5","CISPR16-2-5","エミッション",2,139,"***申請書上から削除済み***","-"]
["エミッション_EN300 386","EN300 386","EN300 386","エミッション",2,140,"***申請書上から削除済み***","-"]
["エミッション_EN301-489-1","EN301-489-1","EN301-489-1","エミッション",2,141,"***申請書上から削除済み***","-"]
["エミッション_EN301-489-17","EN301-489-17","EN301-489-17","エミッション",2,142,"***申請書上から削除済み***","-"]
["イミュニティ","イミュニティ試験","Immunity test","試験規格",1,143,null,"15．試験規格－電磁両立性イミュニティ"]
["イミュニティ_CISPR14-2","CISPR14-2","CISPR14-2","イミュニティ",2,144,null,"CISPR14-2"]
["イミュニティ_CISPR20","CISPR20","CISPR20","イミュニティ",2,145,null,"CISPR20"]
["イミュニティ_CISPR24","CISPR24","CISPR24","イミュニティ",2,146,null,"CISPR24"]
["イミュニティ_EN55014-2","EN55014-2","EN55014-2","イミュニティ",2,147,null,"EN55014-2"]
["イミュニティ_EN55020","EN55020","EN55020","イミュニティ",2,148,null,"EN55020"]
["イミュニティ_EN55024","EN55024","EN55024","イミュニティ",2,149,null,"EN55024"]
["イミュニティ_IEC61000-6-1","IEC61000-6-1","IEC61000-6-1","イミュニティ",2,150,null,"IEC61000-6-1"]
["イミュニティ_IEC61000-6-2","IEC61000-6-2","IEC61000-6-2","イミュニティ",2,151,null,"IEC61000-6-2"]
["イミュニティ_EN61000-6-1","EN61000-6-1","EN61000-6-1","イミュニティ",2,152,null,"EN61000-6-1"]
["イミュニティ_EN61000-6-2","EN61000-6-2","EN61000-6-2","イミュニティ",2,153,null,"EN61000-6-2"]
["イミュニティ_AS_NZS_CISPR14-2","AS/NZS_CISPR14-2","AS/NZS_CISPR14-2","イミュニティ",2,154,null,"AS/NZS CISPR14.2"]
["イミュニティ_AS_NZS_CISPR20","AS/NZS_CISPR20","AS/NZS_CISPR20","イミュニティ",2,155,null,"AS/NZS CISPR20"]
["イミュニティ_AS_NZS_CISPR24","AS/NZS_CISPR24","AS/NZS_CISPR24","イミュニティ",2,156,null,"AS/NZS CISPR24"]
["イミュニティ_AS_NZS_3200-1-2","AS/NZS_3200-1-2","AS/NZS_3200-1-2","イミュニティ",2,157,null,"AS/NZS 3200.1.2"]
["イミュニティ_AS_NZS_61000-6-1","AS/NZS_61000-6-1","AS/NZS_61000-6-1","イミュニティ",2,158,null,"AS/NZS 61000.6.1"]
["イミュニティ_AS_NZS_61000-6-2","AS/NZS_61000-6-2","AS/NZS_61000-6-2","イミュニティ",2,159,null,"AS/NZS 61000.6.2"]
["イミュニティ_JIS_C61000-6-1","JIS C61000-6-1","JIS C61000-6-1","イミュニティ",2,160,null,"JIS C61000-6-1"]
["イミュニティ_JIS_C61000-6-2","JIS C61000-6-2","JIS C61000-6-2","イミュニティ",2,161,null,"JIS C61000-6-2"]
["イミュニティ_J1000","J1000","J1000","イミュニティ",2,162,null,"J1000"]
["イミュニティ_EN55103-2","EN55103-2","EN55103-2","イミュニティ",2,163,null,"EN55103-2"]
["イミュニティ_EN12016","EN12016","EN12016","イミュニティ",2,164,null,"EN12016"]
["イミュニティ_K00014-1","K00014-1","K00014-1","イミュニティ",2,165,null,"K00014-1"]
["イミュニティ_K00020","K00020","K00020","イミュニティ",2,166,null,"K00020"]
["イミュニティ_K00024","K00024","K00024","イミュニティ",2,167,null,"K00024"]
["イミュニティ_KN24","KN24","KN24","イミュニティ",2,168,null,"KN24"]
["イミュニティ_GB4343_2","GB4343.2","GB4343.2","イミュニティ",2,169,null,"GB4343.2"]
["イミュニティ_GOST_R51318_14_2","GOST R51318.14.2","GOST R51318.14.2","イミュニティ",2,170,null,"GOST R51318.14.2"]
["イミュニティ_GOST_R51318_24","GOST R51318.24","GOST R51318.24","イミュニティ",2,171,null,"GOST R51318.24"]
["イミュニティ_IEC61800-3","IEC61800-3","IEC61800-3","イミュニティ",2,172,null,"IEC61800-3"]
["イミュニティ_EN61800-3","EN61800-3","EN61800-3","イミュニティ",2,173,null,"EN61800-3"]
["イミュニティ_EN61326-2","EN61326-2","EN61326-2","イミュニティ",2,174,"***申請書上から削除済み***","-"]
["イミュニティ_IEC61326-2","IEC61326-2","IEC61326-2","イミュニティ",2,175,"***申請書上から削除済み***","-"]
["イミュニティ_IEC61326-3-1","IEC61326-3-1","IEC61326-3-1","イミュニティ",2,176,null,"IEC 61326-3-1"]
["イミュニティ_EN61326-3-2","EN61326-3-2","EN61326-3-2","イミュニティ",2,177,null,"EN 61326-3-2"]
["イミュニティ_IEC61547","IEC61547","IEC61547","イミュニティ",2,178,null,"IEC 61547"]
["イミュニティ_EN61547","EN61547","EN61547","イミュニティ",2,179,null,"EN 61547"]
["イミュニティ_EN50130-4","EN50130-4","EN50130-4","イミュニティ",2,180,null,"EN 50130-4"]
["イミュニティ_IEC60533","IEC60533","IEC60533","イミュニティ",2,181,null,"IEC 60533"]
["イミュニティ_EN60533","EN60533","EN60533","イミュニティ",2,182,null,"EN 60533"]
["イミュニティ_IEC60945","IEC60945","IEC60945","イミュニティ",2,183,null,"IEC 60945"]
["イミュニティ_EN60945","EN60945","EN60945","イミュニティ",2,184,null,"EN 60945"]
["イミュニティ_EN13309","EN13309","EN13309","イミュニティ",2,185,null,"EN13309"]
["イミュニティ_IEC62236-3-2","IEC62236-3-2","IEC62236-3-2","イミュニティ",2,186,null,"IEC 62236-3-2"]
["イミュニティ_EN50121-3-2","EN50121-3-2","EN50121-3-2","イミュニティ",2,187,null,"EN 50121-3-2"]
["イミュニティ_IEC62236-4","IEC62236-4","IEC62236-4","イミュニティ",2,188,null,"IEC 62236-4"]
["イミュニティ_EN50121-4","EN50121-4","EN50121-4","イミュニティ",2,189,null,"EN 50121-4"]
["イミュニティ_ISO22200","ISO22200","ISO22200","イミュニティ",2,190,null,"ISO 22200"]
["イミュニティ_KN61547","KN61547","KN61547","イミュニティ",2,191,null,"KN 61547"]
["イミュニティ_日本海事協会規格第7編1章","日本海事協会規格（船用材料機器）第7編1章","Nippon Kaiji Kyokai Technical rule of Materials and Equipment for Marine Use : Article 7 Chapter 1（Rules for the Automatic and Remote control）","イミュニティ",2,192,null,"日本海事協会規格(船用材料機器)第７編１章（自動化機器および装置）"]
["イミュニティ_ICAS_E10","ICAS E10","ICAS E10","イミュニティ",2,193,null,"ICAS E10"]
["イミュニティ_IEC61326-1","IEC61326-1","IEC61326-1","イミュニティ",2,194,null,"IEC61326-1(製品個別要求条件IEC61326-2シリーズ)*"]
["イミュニティ_EN61326-1","EN61326-1","EN61326-1","イミュニティ",2,195,null,"EN61326-1(製品個別要求条件IEC61326-2シリーズ)*"]
["イミュニティ_IEC60601-1-2","IEC60601-1-2","IEC60601-1-2","イミュニティ",2,196,null,"IEC60601-1-2(製品個別要求条件IEC60601-2シリーズ)*"]
["イミュニティ_EN60601-1-2","EN60601-1-2","EN60601-1-2","イミュニティ",2,197,null,"EN60601-1-2(製品個別要求条件EN60601-2シリーズ)*"]
["イミュニティ_JIS_C1806-1","JIS C1806-1","JIS C1806-1","イミュニティ",2,198,null,"JIS C1806-1"]
["イミュニティ_JIS_T0601-1-2","JIS T0601-1-2","JIS T0601-1-2","イミュニティ",2,199,null,"JIS T0601-1-2(製品個別要求条件JIS T0601-2シリーズ)*"]
["イミュニティ_EN 61000-4-14","EN 61000-4-14","EN 61000-4-14","イミュニティ",2,200,"***申請書上から削除済み***","-"]
["イミュニティ_IEC 61000-4-14","IEC 61000-4-14","IEC 61000-4-14","イミュニティ",2,201,"***申請書上から削除済み***","-"]
["イミュニティ_EN 61000-4-28","EN 61000-4-28","EN 61000-4-28","イミュニティ",2,202,"***申請書上から削除済み***","-"]
["イミュニティ_IEC 61000-4-28","IEC 61000-4-28","IEC 61000-4-28","イミュニティ",2,203,"***申請書上から削除済み***","-"]
["イミュニティ_JIS C 61000-4-2","JIS C 61000-4-2","JIS C 61000-4-2","イミュニティ",2,204,"***申請書上から削除済み***","-"]
["イミュニティ_JIS C 61000-4-3","JIS C 61000-4-3","JIS C 61000-4-3","イミュニティ",2,205,"***申請書上から削除済み***","-"]
["イミュニティ_JIS C 61000-4-4","JIS C 61000-4-4","JIS C 61000-4-4","イミュニティ",2,206,"***申請書上から削除済み***","-"]
["イミュニティ_JIS C 61000-4-5","JIS C 61000-4-5","JIS C 61000-4-5","イミュニティ",2,207,"***申請書上から削除済み***","-"]
["イミュニティ_JIS C 61000-4-6","JIS C 61000-4-6","JIS C 61000-4-6","イミュニティ",2,208,"***申請書上から削除済み***","-"]
["イミュニティ_JIS C 61000-4-8","JIS C 61000-4-8","JIS C 61000-4-8","イミュニティ",2,209,"***申請書上から削除済み***","-"]
["イミュニティ_JIS C 61000-4-11","JIS C 61000-4-11","JIS C 61000-4-11","イミュニティ",2,210,"***申請書上から削除済み***","-"]
["イミュニティ_IEC61326-2-1","IEC61326-2-1","IEC61326-2-1","イミュニティ",2,211,"***申請書上から削除済み***","-"]
["イミュニティ_EN 61326-2-1","EN 61326-2-1","EN 61326-2-1","イミュニティ",2,212,"***申請書上から削除済み***","-"]
["イミュニティ_IEC 61326-2-2","IEC 61326-2-2","IEC 61326-2-2","イミュニティ",2,213,"***申請書上から削除済み***","-"]
["イミュニティ_EN 61326-2-2","EN 61326-2-2","EN 61326-2-2","イミュニティ",2,214,"***申請書上から削除済み***","-"]
["イミュニティ_IEC61326-2-6","IEC61326-2-6","IEC61326-2-6","イミュニティ",2,215,"***申請書上から削除済み***","-"]
["イミュニティ_EN 61326-2-6","EN 61326-2-6","EN 61326-2-6","イミュニティ",2,216,"***申請書上から削除済み***","-"]
["イミュニティ_EN 50121-5","EN 50121-5","EN 50121-5","イミュニティ",2,217,"***申請書上から削除済み***","-"]
["イミュニティ_IEC 62236-5","IEC 62236-5","IEC 62236-5","イミュニティ",2,218,"***申請書上から削除済み***","-"]
["イミュニティ_IEC61851-21","IEC61851-21","IEC61851-21","イミュニティ",2,219,"***申請書上から削除済み***","-"]
["イミュニティ_EN 61851-21","EN 61851-21","EN 61851-21","イミュニティ",2,220,"***申請書上から削除済み***","-"]
["イミュニティ_IEC62040-2","IEC62040-2","IEC62040-2","イミュニティ",2,221,"***申請書上から削除済み***","-"]
["イミュニティ_EN 62040-2","EN 62040-2","EN 62040-2","イミュニティ",2,222,"***申請書上から削除済み***","-"]
["イミュニティ_CISPR16-1-2","CISPR16-1-2","CISPR16-1-2","イミュニティ",2,223,"***申請書上から削除済み***","-"]
["イミュニティ_CISPR16-1-3","CISPR16-1-3","CISPR16-1-3","イミュニティ",2,224,"***申請書上から削除済み***","-"]
["イミュニティ_CISPR16-1-4","CISPR16-1-4","CISPR16-1-4","イミュニティ",2,225,"***申請書上から削除済み***","-"]
["イミュニティ_CISPR16-2-1","CISPR16-2-1","CISPR16-2-1","イミュニティ",2,226,"***申請書上から削除済み***","-"]
["イミュニティ_CISPR16-2-2","CISPR16-2-2","CISPR16-2-2","イミュニティ",2,227,"***申請書上から削除済み***","-"]
["イミュニティ_CISPR16-2-3","CISPR16-2-3","CISPR16-2-3","イミュニティ",2,228,"***申請書上から削除済み***","-"]
["イミュニティ_CISPR16-2-5","CISPR16-2-5","CISPR16-2-5","イミュニティ",2,229,"***申請書上から削除済み***","-"]
["イミュニティ_JIS C4411-2","JIS C4411-2","JIS C4411-2","イミュニティ",2,230,"***申請書上から削除済み***","-"]
["イミュニティ_AS/NZS CISPR20","AS/NZS CISPR20","AS/NZS CISPR20","イミュニティ",2,231,"***申請書上から削除済み***","-"]
["イミュニティ_IEC61000-4-2","IEC61000-4-2","IEC61000-4-2","イミュニティ",2,232,"***申請書上から削除済み***","-"]
["イミュニティ_EN61000-4-2","EN61000-4-2","EN61000-4-2","イミュニティ",2,233,"***申請書上から削除済み***","-"]
["イミュニティ_IEC61000-4-3","IEC61000-4-3","IEC61000-4-3","イミュニティ",2,234,"***申請書上から削除済み***","-"]
["イミュニティ_EN61000-4-3","EN61000-4-3","EN61000-4-3","イミュニティ",2,235,"***申請書上から削除済み***","-"]
["イミュニティ_EN61000-4-4","EN61000-4-4","EN61000-4-4","イミュニティ",2,236,"***申請書上から削除済み***","-"]
["イミュニティ_IEC61000-4-4","IEC61000-4-4","IEC61000-4-4","イミュニティ",2,237,"***申請書上から削除済み***","-"]
["イミュニティ_IEC61000-4-5","IEC61000-4-5","IEC61000-4-5","イミュニティ",2,238,"***申請書上から削除済み***","-"]
["イミュニティ_EN61000-4-5","EN61000-4-5","EN61000-4-5","イミュニティ",2,239,"***申請書上から削除済み***","-"]
["イミュニティ_IEC61000-4-6","IEC61000-4-6","IEC61000-4-6","イミュニティ",2,240,"***申請書上から削除済み***","-"]
["イミュニティ_EN61000-4-6","EN61000-4-6","EN61000-4-6","イミュニティ",2,241,"***申請書上から削除済み***","-"]
["イミュニティ_IEC61000-4-8","IEC61000-4-8","IEC61000-4-8","イミュニティ",2,242,"***申請書上から削除済み***","-"]
["イミュニティ_EN61000-4-8","EN61000-4-8","EN61000-4-8","イミュニティ",2,243,"***申請書上から削除済み***","-"]
["イミュニティ_IEC61000-4-9","IEC61000-4-9","IEC61000-4-9","イミュニティ",2,244,"***申請書上から削除済み***","-"]
["イミュニティ_EN61000-4-9","EN61000-4-9","EN61000-4-9","イミュニティ",2,245,"***申請書上から削除済み***","-"]
["イミュニティ_IEC61000-4-11","IEC61000-4-11","IEC61000-4-11","イミュニティ",2,246,"***申請書上から削除済み***","-"]
["イミュニティ_EN61000-4-11","EN61000-4-11","EN61000-4-11","イミュニティ",2,247,"***申請書上から削除済み***","-"]
["イミュニティ_IEC61000-4-12","IEC61000-4-12","IEC61000-4-12","イミュニティ",2,248,"***申請書上から削除済み***","-"]
["イミュニティ_EN61000-4-12","EN61000-4-12","EN61000-4-12","イミュニティ",2,249,"***申請書上から削除済み***","-"]
["イミュニティ_IEC61000-4-13","IEC61000-4-13","IEC61000-4-13","イミュニティ",2,250,"***申請書上から削除済み***","-"]
["イミュニティ_EN61000-4-13","EN61000-4-13","EN61000-4-13","イミュニティ",2,251,"***申請書上から削除済み***","-"]
["イミュニティ_IEC61000-4-16","IEC61000-4-16","IEC61000-4-16","イミュニティ",2,252,"***申請書上から削除済み***","-"]
["イミュニティ_EN61000-4-16","EN61000-4-16","EN61000-4-16","イミュニティ",2,253,"***申請書上から削除済み***","-"]
["イミュニティ_IEC61000-4-29","IEC61000-4-29","IEC61000-4-29","イミュニティ",2,254,"***申請書上から削除済み***","-"]
["イミュニティ_EN61000-4-29","EN61000-4-29","EN61000-4-29","イミュニティ",2,255,"***申請書上から削除済み***","-"]
["イミュニティ_IEC61000-4-34","IEC61000-4-34","IEC61000-4-34","イミュニティ",2,256,"***申請書上から削除済み***","-"]
["イミュニティ_EN61000-4-34","EN61000-4-34","EN61000-4-34","イミュニティ",2,257,"***申請書上から削除済み***","-"]
["イミュニティ_IEC61000-6-7","IEC61000-6-7","IEC61000-6-7","イミュニティ",2,258,"***申請書上から削除済み***","-"]
["イミュニティ_EN61000-6-7","EN61000-6-7","EN61000-6-7","イミュニティ",2,259,"***申請書上から削除済み***","-"]
["イミュニティ_EN 50412-2-1","EN 50412-2-1","EN 50412-2-1","イミュニティ",2,260,"***申請書上から削除済み***","-"]
["イミュニティ_EN300 386","EN300 386","EN300 386","イミュニティ",2,261,"***申請書上から削除済み***","-"]
["イミュニティ_EN301-489-1","EN301-489-1","EN301-489-1","イミュニティ",2,262,"***申請書上から削除済み***","-"]
["イミュニティ_EN301-489-17","EN301-489-17","EN301-489-17","イミュニティ",2,263,"***申請書上から削除済み***","-"]
["電源高調波","電源高調波試験","Harmonic Test in Public Low Voltage Systems","試験規格",1,264,null,"16．試験規格－電源高調波"]
["電源高調波_IEC61000-3-2","IEC61000-3-2","IEC61000-3-2","電源高調波",2,265,null,"IEC61000-3-2"]
["電源高調波_IEC61000-3-12","IEC61000-3-12","IEC61000-3-12","電源高調波",2,266,null,"IEC61000-3-12"]
["電源高調波_IEC61000-3-3","IEC61000-3-3","IEC61000-3-3","電源高調波",2,267,null,"IEC61000-3-3"]
["電源高調波_IEC61000-3-11","IEC61000-3-11","IEC61000-3-11","電源高調波",2,268,null,"IEC61000-3-11"]
["電源高調波_JIS_C61000-3-2","JIS C61000-3-2","JIS C61000-3-2","電源高調波",2,269,null,"JIS C61000-3-2"]
["電源高調波_IEC61000-6-3","IEC61000-6-3","IEC61000-6-3","電源高調波",2,270,null,"IEC61000-6-3"]
["電源高調波_IEC61000-6-4","IEC61000-6-4","IEC61000-6-4","電源高調波",2,271,null,"IEC61000-6-4"]
["電源高調波_EN61000-6-3","EN61000-6-3","EN61000-6-3","電源高調波",2,272,null,"EN61000-6-3"]
["電源高調波_EN61000-6-4","EN61000-6-4","EN61000-6-4","電源高調波",2,273,null,"EN61000-6-4"]
["電源高調波_EN61000-3-2","EN61000-3-2","EN61000-3-2","電源高調波",2,274,null,"EN61000-3-2"]
["電源高調波_EN61000-3-12","EN61000-3-12","EN61000-3-12","電源高調波",2,275,null,"EN61000-3-12"]
["電源高調波_EN61000-3-3","EN61000-3-3","EN61000-3-3","電源高調波",2,276,null,"EN61000-3-3"]
["電源高調波_EN61000-3-11","EN61000-3-11","EN61000-3-11","電源高調波",2,277,null,"EN61000-3-11"]
["電源高調波_AS_NZS_3200-1-2","AS/NZS_3200-1-2","AS/NZS_3200-1-2","電源高調波",2,278,null,"AS/NZS 3200.1.2"]
["電源高調波_AS_NZS_61000-3-2","AS/NZS_61000-3-2","AS/NZS_61000-3-2","電源高調波",2,279,null,"AS/NZS 61000.3.2"]
["電源高調波_AS_NZS_61000-3-12","AS/NZS_61000-3-4","AS/NZS_61000-3-4","電源高調波",2,280,null,"AS/NZS 61000.3.12"]
["電源高調波_AS_NZS_61000-3-3","AS/NZS_61000-3-3","AS/NZS_61000-3-3","電源高調波",2,281,null,"AS/NZS 61000.3.3"]
["電源高調波_AS_NZS_61000-3-11","AS/NZS_61000-3-11","AS/NZS_61000-3-11","電源高調波",2,282,null,"AS/NZS 61000.3.11"]
["電源高調波_AS_NZS_61000-6-3","AS/NZS_61000-6-3","AS/NZS_61000-6-3","電源高調波",2,283,null,"AS/NZS 61000.6.3"]
["電源高調波_AS_NZS_61000-6-4","AS/NZS_61000-6-4","AS/NZS_61000-6-4","電源高調波",2,284,null,"AS/NZS 61000.6.4"]
["電源高調波_GB17625_1","GB17625.1","GB17625.1","電源高調波",2,285,null,"GB17625.1"]
["電源高調波_GOST_R51317_3_2","GOST R51317.3.2","GOST R51317.3.2","電源高調波",2,286,null,"GOST R51317.3.2"]
["電源高調波_GOST_R51317_3_3","GOST R51317.3.3","GOST R51317.3.3","電源高調波",2,287,null,"GOST R51317.3.3"]
["電源高調波_IEC61326-1","IEC61326-1","IEC61326-1","電源高調波",2,288,null,"IEC61326-1(製品個別要求条件IEC61326-2シリーズ)*"]
["電源高調波_EN61326-1","EN61326-1","EN61326-1","電源高調波",2,289,null,"EN61326-1(製品個別要求条件IEC61326-2シリーズ)*"]
["電源高調波_EN61326-2","EN61326-2","EN61326-2","電源高調波",2,290,"***申請書上から削除済み***","-"]
["電源高調波_IEC60601-1-2","IEC60601-1-2","IEC60601-1-2","電源高調波",2,291,null,"IEC60601-1-2(製品個別要求条件IEC60601-2シリーズ)*"]
["電源高調波_EN60601-1-2","EN60601-1-2","EN60601-1-2","電源高調波",2,292,null,"EN60601-1-2(製品個別要求条件EN60601-2シリーズ)*"]
["電源高調波_JIS_C1806-1","JIS C1806-1","JIS C1806-1","電源高調波",2,293,null,"JIS C1806-1"]
["電源高調波_JIS_T0601-1-2","JIS T0601-1-2","JIS T0601-1-2","電源高調波",2,294,null,"JIS T0601-1-2(製品個別要求条件JIS T0601-2シリーズ)*"]
["電源高調波_EN 61000-4-13","EN 61000-4-13","EN 61000-4-13","電源高調波",2,295,"***申請書上から削除済み***","-"]
["電源高調波_IEC 61000-4-13","IEC 61000-4-13","IEC 61000-4-13","電源高調波",2,296,"***申請書上から削除済み***","-"]
["電源高調波_EN300 386","EN300 386","EN300 386","電源高調波",2,297,"***申請書上から削除済み***","-"]
["電源高調波_EN301-489-1","EN301-489-1","EN301-489-1","電源高調波",2,298,"***申請書上から削除済み***","-"]
["電源高調波_EN301-489-17","EN301-489-17","EN301-489-17","電源高調波",2,299,"***申請書上から削除済み***","-"]
["自動車車載機器","自動車・車載機器","Electronic equipment in vehicles","試験規格",1,300,null,"17．試験規格－自動車・車載機器"]
["自動車車載機器_EU_Directive_72_245_EEC","EU Directive 72/245/EEC","EU Directive 72/245/EEC","自動車車載機器",2,301,null,"EU Directive 72/245/EEC"]
["自動車車載機器_EU_Directive_2004_104_EC","EU Directive 2004/104/EC, Annex I, 6.5, 6.6, 6.8, 6.9章","EU Directive 2004/104/EC, Annex I, clause 6.5, 6.6, 6.8, 6.9","自動車車載機器",2,302,null,"EU Directive 2004/104/EC, Annex I, 6.5, 6.6, 6.8, 6.9章"]
["自動車車載機器_ECE_R-10","ECE R-10, 6.5, 6.6, 6.8, 6.9章","ECE R-10, clause6.5, 6.6, 6.8, 6.9","自動車車載機器",2,303,null,"ECE R-10, 6.5, 6.6, 6.8, 6.9章"]
["自動車車載機器_EN50498","EN 50498","EN 50498","自動車車載機器",2,304,null,"EN 50498"]
["自動車車載機器_自動車EMC指令 2004/104/EC, Annex I, 6.7","自動車EMC指令 2004/104/EC, Annex I, 6.7","EU Dirctive 2004/104/EC, Annex I, 6.7","自動車車載機器",2,305,"***申請書上から削除済み***","-"]
["自動車車載機器_ECE R-10, 6.7, Annex 7 (ESA/RESSのみ)","ECE R-10, 6.7, Annex 7 (ESA/RESSのみ)","ECE R-10, 6.7, Annex 7 (ESA/RESS Only)","自動車車載機器",2,306,"***申請書上から削除済み***","-"]
["自動車車載機器_ECE R-116, Annex 9","ECE R-116, Annex 9","ECE R-116, Annex 9","自動車車載機器",2,307,"***申請書上から削除済み***","-"]
["自動車車載機器_2004/104/EC Annex I, 6.7","2004/104/EC Annex I, 6.7","2004/104/EC Annex I, 6.7","自動車車載機器",2,308,"***申請書上から削除済み***","-"]
["自動車車載機器_EN 61851-21 (EMC試験のみ)","EN 61851-21 (EMC試験のみ)","EN 61851-21 (EMC Part only)","自動車車載機器",2,309,"***申請書上から削除済み***","-"]
["自動車車載機器_IEC 61851-21 (EMC試験のみ)","IEC 61851-21 (EMC試験のみ)","IEC 61851-21 (EMC Part only)","自動車車載機器",2,310,"***申請書上から削除済み***","-"]
["空気伝搬騒音","空気伝搬騒音試験","Airborne noise emission test","試験規格",1,311,null,"18．試験規格－音響"]
["空気伝搬騒音_ISO7779","ISO7779","ISO7779","空気伝搬騒音",2,312,null,"ISO 7779"]
["空気伝搬騒音_JIS_X7779","JIS X7779","JIS X7779","空気伝搬騒音",2,313,null,"JIS X7779"]
["空気伝搬騒音_EN_ISO7779","EN_ISO7779","EN_ISO7779","空気伝搬騒音",2,314,null,"EN ISO 7779"]
["空気伝搬騒音_ECMA-74","ECMA-74","ECMA-74","空気伝搬騒音",2,315,null,"ECMA-74"]
["空気伝搬騒音_ブルーエンジェルマーク","ブルーエンジェルマーク","Blue Angel mark","空気伝搬騒音",2,316,null,"German BlueAngel"]
["空気伝搬騒音_ブルーエンジェルマーク_RAL-UZ78","RAL-UZ78","RAL-UZ78","空気伝搬騒音",2,317,null,"RAL-UZ 78"]
["空気伝搬騒音_ブルーエンジェルマーク_RAL-UZ122","RAL-UZ122","RAL-UZ122","空気伝搬騒音",2,318,null,"RAL-UZ 122"]
["空気伝搬騒音_ブルーエンジェルマーク_RAL-UZ127","RAL-UZ127","RAL-UZ127","空気伝搬騒音",2,319,null,"RAL-UZ 127"]
["空気伝搬騒音_ブルーエンジェルマーク_RAL-UZ171","RAL-UZ171","RAL-UZ171","空気伝搬騒音",2,320,null,"RAL-UZ 171"]
["空気伝搬騒音_日本環境協会エコマーク商品類型","日本環境協会エコマーク商品類型","Japan Environment Association Eco Mark products category","空気伝搬騒音",2,321,null,"日本環境協会エコマーク商品類型"]
["空気伝搬騒音_日本環境協会エコマーク商品類型_No117","No.117","No.117","空気伝搬騒音",2,322,null,"No.117"]
["空気伝搬騒音_日本環境協会エコマーク商品類型_No119","No.119","No.119","空気伝搬騒音",2,323,null,"No.119"]
["空気伝搬騒音_日本環境協会エコマーク商品類型_No122","No.122","No.122","空気伝搬騒音",2,324,null,"No.122"]
["空気伝搬騒音_日本環境協会エコマーク商品類型_No155","No.155","No.155","空気伝搬騒音",2,325,null,"No.155"]
["通信機器性能","通信機器性能試験","Telecommunication characteristic test","試験規格",1,326,null,"19．試験規格－通信機性能 １"]
["通信機器性能_FCC_Part15_Sub_C","FCC_Part15_Sub_C","FCC_Part15_Sub_C","通信機器性能",2,327,null,"FCC Part15 Sub.C"]
["通信機器性能_FCC_Part15_Sub_D","FCC_Part15_Sub_D","FCC_Part15_Sub_D","通信機器性能",2,328,null,"FCC Part15 Sub.D "]
["通信機器性能_FCC_Part15_Sub_E","FCC_Part15_Sub_E","FCC_Part15_Sub_E","通信機器性能",2,329,null,"FCC Part15 Sub.E"]
["通信機器性能_FCC_Part22_Sub_E","FCC_Part22_Sub_E","FCC_Part22_Sub_E","通信機器性能",2,330,null,"FCC Part22 Sub.E"]
["通信機器性能_FCC_Part22_Sub_H","FCC_Part22_Sub_H","FCC_Part22_Sub_H","通信機器性能",2,331,null,"FCC Part22 Sub.H "]
["通信機器性能_FCC_Part24_Sub_D","FCC_Part24_Sub_D","FCC_Part24_Sub_D","通信機器性能",2,332,null,"FCC Part24 Sub.D "]
["通信機器性能_FCC_Part24_Sub_E","FCC_Part24_Sub_E","FCC_Part24_Sub_E","通信機器性能",2,333,null,"FCC Part24 Sub.E"]
["通信機器性能_FCC_Part25","FCC_Part25","FCC_Part25","通信機器性能",2,334,null,"FCC Part25"]
["通信機器性能_FCC_Part27","FCC_Part27","FCC_Part27","通信機器性能",2,335,null,"FCC Part27"]
["通信機器性能_FCC_Part74","FCC_Part74","FCC_Part74","通信機器性能",2,336,null,"FCC Part74  "]
["通信機器性能_FCC_Part80","FCC_Part80","FCC_Part80","通信機器性能",2,337,null,"FCC Part80  "]
["通信機器性能_FCC_Part90","FCC_Part90","FCC_Part90","通信機器性能",2,338,null,"FCC Part90 "]
["通信機器性能_FCC_Part95","FCC_Part95","FCC_Part95","通信機器性能",2,339,null,"FCC Part95"]
["通信機器性能_FCC_Part97","FCC_Part97","FCC_Part97","通信機器性能",2,340,null,"FCC Part97"]
["通信機器性能_IC_RSSGen","IC_RSSGen","IC_RSSGen","通信機器性能",2,341,null,"IC RSS-Gen"]
["通信機器性能_IC_RSS210","IC_RSS210","IC_RSS210","通信機器性能",2,342,null,"IC RSS-210"]
["通信機器性能_IC_RSS247","IC_RSS247","IC_RSS247","通信機器性能",2,343,null,"IC RSS-247"]
["通信機器性能_IC_RSS310","IC_RSS310","IC_RSS310","通信機器性能",2,344,null,"IC RSS-310"]
["通信機器性能_IC_RSS118","IC_RSS118","IC_RSS118","通信機器性能",2,345,null,"IC RSS-118"]
["通信機器性能_IC_RSS132","IC_RSS132","IC_RSS132","通信機器性能",2,346,null,"IC RSS-132"]
["通信機器性能_IC_RSS133","IC_RSS133","IC_RSS133","通信機器性能",2,347,null,"IC RSS-133"]
["通信機器性能_IC_RSS119","IC_RSS119","IC_RSS119","通信機器性能",2,348,null,"IC RSS-119"]
["通信機器性能_IC_RSS135","IC_RSS135","IC_RSS135","通信機器性能",2,349,null,"IC RSS-135"]
["通信機器性能_IC_RSS215","IC_RSS215","IC_RSS215","通信機器性能",2,350,null,"IC RSS-215"]
["通信機器性能_EN300_328","EN300_328","EN300_328","通信機器性能",2,351,null,"EN 300 328 V1.9.1"]
["通信機器性能_EN300_328_SUB","EN300_328","EN300_328","通信機器性能",2,352,"***申請書上から削除済み***","-"]
["通信機器性能_EN300_328-1","EN300_328-1","EN300_328-1","通信機器性能",2,353,"***申請書上から削除済み***","-"]
["通信機器性能_EN300_328-2","EN300_328-2","EN300_328-2","通信機器性能",2,354,"***申請書上から削除済み***","-"]
["通信機器性能_EN301_357-1","EN301_357-1","EN301_357-1","通信機器性能",2,355,null,"EN 301 357-1 "]
["通信機器性能_EN301_357-2","EN301_357-2","EN301_357-2","通信機器性能",2,356,null,"EN 301 357-2"]
["通信機器性能_EN301_893","EN301_893","EN301_893","通信機器性能",2,357,null,"EN 301 893"]
["通信機器性能_EN300_086","EN300_086","EN300_086","通信機器性能",2,358,null,"EN 300 086"]
["通信機器性能_EN300_086-1","EN300_086-1","EN300_086-1","通信機器性能",2,359,null,"EN 300 086-1"]
["通信機器性能_EN300_086-2","EN300_086-2","EN300_086-2","通信機器性能",2,360,null,"EN 300 086-2"]
["通信機器性能_EN300_219","EN300_219","EN300_219","通信機器性能",2,361,null,"EN 300 219"]
["通信機器性能_EN300_219-1","EN300_219-1","EN300_219-1","通信機器性能",2,362,null,"EN 300 219-1"]
["通信機器性能_EN300_219-2","EN300_219-2","EN300_219-2","通信機器性能",2,363,null,"EN 300 219-2"]
["通信機器性能_EN300_113","EN300_113","EN300_113","通信機器性能",2,364,null,"EN 300 113"]
["通信機器性能_EN300_113-1","EN300_113-1","EN300_113-1","通信機器性能",2,365,null,"EN 300 113-1"]
["通信機器性能_EN300_113-2","EN300_113-2","EN300_113-2","通信機器性能",2,366,null,"EN 300 113-2"]
["通信機器性能_EN301_166","EN301_166","EN301_166","通信機器性能",2,367,null,"EN 301 166"]
["通信機器性能_EN301_166-1","EN301_166-1","EN301_166-1","通信機器性能",2,368,null,"EN 301 166-1"]
["通信機器性能_EN301_166-2","EN301_166-2","EN301_166-2","通信機器性能",2,369,null,"EN 301 166-2"]
["通信機器性能_EN301_489-1","EN301_489-1","EN301_489-1","通信機器性能",2,370,null,"EN 301 489-1"]
["通信機器性能_EN301_489_SUB","EN301_489","EN301_489","通信機器性能",2,371,null,"EN 301 489-"]
["通信機器性能_EN301_489-17","EN301_489-17","EN301_489-17","通信機器性能",2,372,"***申請書上から削除済み***","-"]
["通信機器性能_EN301_511","EN301_511","EN301_511","通信機器性能",2,373,null,"EN 301 511"]
["通信機器性能_EN301_908-1","EN301_908-1","EN301_908-1","通信機器性能",2,374,null,"EN 301 908-1"]
["通信機器性能_EN302_291-1","EN302_291-1","EN302_291-1","通信機器性能",2,375,null,"EN 302 291-1"]
["通信機器性能_EN302_291-2","EN302_291-2","EN302_291-2","通信機器性能",2,376,null,"EN 302 291-2"]
["通信機器性能_EN300_220","EN300_220","EN300_220","通信機器性能",2,377,null,"EN 300 220"]
["通信機器性能_EN300_220-1","EN300_220-1","EN300_220-1","通信機器性能",2,378,null,"EN 300 220-1"]
["通信機器性能_EN300_220-2","EN300_220-2","EN300_220-2","通信機器性能",2,379,null,"EN 300 220-2"]
["通信機器性能_EN300_330","EN300_330","EN300_330","通信機器性能",2,380,null,"EN 300 330"]
["通信機器性能_EN300_330-1","EN300_330-1","EN300_330-1","通信機器性能",2,381,null,"EN 300 330-1"]
["通信機器性能_EN300_330-2","EN300_330-2","EN300_330-2","通信機器性能",2,382,null,"EN 300 330-2"]
["通信機器性能_EN300_440","EN300_440","EN300_440","通信機器性能",2,383,null,"EN 300 440"]
["通信機器性能_EN300_440-1","EN300_440-1","EN300_440-1","通信機器性能",2,384,null,"EN 300 440-1"]
["通信機器性能_EN300_440-2","EN300_440-2","EN300_440-2","通信機器性能",2,385,null,"EN 300 440-2"]
["通信機器性能_EN300_422","EN300_422","EN300_422","通信機器性能",2,386,null,"EN 300 422"]
["通信機器性能_EN300_422-1","EN300_422-1","EN300_422-1","通信機器性能",2,387,null,"EN 300 422-1"]
["通信機器性能_EN300_422-2","EN300_422-2","EN300_422-2","通信機器性能",2,388,null,"EN 300 422-2"]
["通信機器性能_ETSI TS 151 010-1 Clause 12.2.1 ","ETSI TS 151 010-1 Clause 12.2.1 ","ETSI TS 151 010-1 Clause 12.2.1 ","通信機器性能",2,389,"***申請書上から削除済み***","-"]
["通信機器性能_ETSI TS 151 010-1 Clause 12.2.2 ","ETSI TS 151 010-1 Clause 12.2.2 ","ETSI TS 151 010-1 Clause 12.2.2 ","通信機器性能",2,390,"***申請書上から削除済み***","-"]
["通信機器性能_3GPP TS 51.010-1 Clause 12.2.1","3GPP TS 51.010-1 Clause 12.2.1","3GPP TS 51.010-1 Clause 12.2.1","通信機器性能",2,391,"***申請書上から削除済み***","-"]
["通信機器性能_3GPP TS 51.010-1 Clause 12.2.2","3GPP TS 51.010-1 Clause 12.2.2","3GPP TS 51.010-1 Clause 12.2.2","通信機器性能",2,392,"***申請書上から削除済み***","-"]
["通信機器性能_FCC Part 20","FCC Part 20","FCC Part 20","通信機器性能",2,393,"***申請書上から削除済み***","-"]
["通信機器性能_FCC Part 101","FCC Part 101","FCC Part 101","通信機器性能",2,394,"***申請書上から削除済み***","-"]
["通信機器性能_ANSI C63.10-2013","ANSI C63.10-2013","ANSI C63.10-2013","通信機器性能",2,395,"***申請書上から削除済み***","-"]
["通信機器性能_KDB 789033","KDB 789033","KDB 789033","通信機器性能",2,396,"***申請書上から削除済み***","-"]
["通信機器性能_KDB 971168","KDB 971168","KDB 971168","通信機器性能",2,397,"***申請書上から削除済み***","-"]
["通信機器性能_KDB 447497 (計算方法のみ)","KDB 447497 (計算方法のみ)","KDB 447497 (Calcuration Method Only)","通信機器性能",2,398,"***申請書上から削除済み***","-"]
["通信機器性能_EN 300-220-3","EN 300-220-3","EN 300-220-3","通信機器性能",2,399,"***申請書上から削除済み***","-"]
["通信機器性能_EN 300 386","EN 300 386","EN 300 386","通信機器性能",2,400,"***申請書上から削除済み***","-"]
["通信機器性能_EN 300 487","EN 300 487","EN 300 487","通信機器性能",2,401,"***申請書上から削除済み***","-"]
["通信機器性能_FCC Part 2 2.1051, 2.1053","FCC Part 2 2.1051, 2.1053","FCC Part 2 2.1051, 2.1053","通信機器性能",2,402,"***申請書上から削除済み***","-"]
["通信機器性能_ANSI C63.10","ANSI C63.10","ANSI C63.10","通信機器性能",2,403,"***申請書上から削除済み***","-"]
["通信機器性能2","通信機性能 2","Telecommunication equipment performance 2","試験規格",1,404,null,"20．試験規格－通信機性能 ２"]
["通信機器性能2_IEC62209_Part1","IEC62209_Part1","IEC62209_Part1","通信機器性能2",2,405,null,"IEC 62209 Part 1"]
["通信機器性能2_IEC62209_Part2","IEC62209_Part2","IEC62209_Part2","通信機器性能2",2,406,null,"IEC 62209 Part 2 "]
["通信機器性能2_EN62209-1","EN62209-1","EN62209-1","通信機器性能2",2,407,null,"EN 62209-1"]
["通信機器性能2_EN62209-2","EN62209-2","EN62209-2","通信機器性能2",2,408,null,"EN 62209-2"]
["通信機器性能2_EN50383","EN50383","EN50383","通信機器性能2",2,409,null,"EN 50383"]
["通信機器性能2_FCC_OET65_SupplementC","FCC_OET65/Supplement C","FCC_OET65/Supplement C","通信機器性能2",2,410,null,"FCC OET65/Supplement C"]
["通信機器性能2_FCC_ANSI_ＩEEE1528","FCC_ANSI/ＩEEE1528","FCC_ANSI/ＩEEE1528","通信機器性能2",2,411,null,"FCC ANSI/IEEE1528"]
["通信機器性能2_IC_RSS102","IC_RSS102","IC_RSS102","通信機器性能2",2,412,null,"IC RSS102"]
["通信機器性能2_IEC62311","IEC62311","IEC62311","通信機器性能2",2,413,null,"IEC 62311"]
["通信機器性能2_EN62311","EN62311","EN62311","通信機器性能2",2,414,null,"EN 62311"]
["通信機器性能2_EN62369-1","EN62369-1","EN62369-1","通信機器性能2",2,415,null,"EN 62369-1"]
["通信機器性能2_IEC62369-1","IEC62369-1","IEC62369-1","通信機器性能2",2,416,null,"IEC 62369-1"]
["通信機器性能2_EN50371","EN50371","EN50371","通信機器性能2",2,417,null,"EN 50371"]
["通信機器性能2_IEC62479","IEC62479","IEC62479","通信機器性能2",2,418,null,"IEC 62479"]
["通信機器性能2_EN62479","EN62479","EN62479","通信機器性能2",2,419,null,"EN 62479"]
["通信機器性能2_EN50385","EN50385","EN50385","通信機器性能2",2,420,null,"EN 50385"]
["通信機器性能2_EN50566","EN50566","EN50566","通信機器性能2",2,421,null,"EN 50566"]
["通信機器性能2_EN50364","EN50364","EN50364","通信機器性能2",2,422,null,"EN 50364"]
["通信機器性能2_IEC62233","IEC62233","IEC62233","通信機器性能2",2,423,null,"IEC 62233"]
["通信機器性能2_EN62233","EN62233","EN62233","通信機器性能2",2,424,null,"EN 62233"]
["通信機器性能2_EN50360","EN50360","EN50360","通信機器性能2",2,425,null,"EN 50360"]
["通信機器性能2_EN50361","EN50361","EN50361","通信機器性能2",2,426,null,"EN 50361"]
["通信機器性能2_EN50366","EN50366","EN50366","通信機器性能2",2,427,null,"EN 50366"]
["通信機器性能2_総務省令無線設備規則_局所比吸収率","総務省令無線設備規則(局所比吸収率)","Ministry of internal Affairs and communications Radio transmission facility enforcement rule(SAR)","通信機器性能2",2,428,null,"総務省令無線設備規則（局所比吸収率）"]
["通信機器性能2_ARIB_STD-T56","ARIB_STD-T56","ARIB_STD-T56","通信機器性能2",2,429,null,"ARIB STD-T56　"]
["通信機器性能3","通信機性能 3","Telecommunication equipment performance 3","試験規格",1,430,null,"21．試験規格－通信機性能 ３"]
["通信機器性能3_FCC_Part68","FCC_Part68","FCC_Part68","通信機器性能3",2,431,null,"FCC Part68"]
["通信機器性能3_ANSI/TIA-968-B,B-1","ANSI/TIA-968-B, B-1","ANSI/TIA-968-B, B-1","通信機器性能3",2,432,null,"ANSI/TIA-968-B, B-1"]
["通信機器性能3_IC_CS-03","IC_CS-03","IC_CS-03","通信機器性能3",2,433,null,"IC CS-03"]
["環境","環境（消費電力）","Environment(Power consumption)","試験規格",1,434,null,"22．試験規格－環境（消費電力）（注：本項を申請する場合は、事前にVLACにご相談ください。）"]
["環境_国際","国際エネルギースタープログラム運用細則","International Energy Star Program operational byelaw","環境",2,435,null,"国際エネルギースタープログラム運用細則"]
["環境_国際_コンピュータ","コンピュータ類","Computers","環境_国際",3,436,null,"コンピュータ類"]
["環境_国際_コンピュータ_デスクトップ","デスクトップ","Desk top","環境_国際_コンピュータ",4,437,null,"デスクトップ"]
["環境_国際_コンピュータ_一体型デスクトップ","一体型デスクトップ","All-in-one desk top","環境_国際_コンピュータ",4,438,null,"一体型デスクトップ"]
["環境_国際_コンピュータ_ノートブック","ノートブック","Note book","環境_国際_コンピュータ",4,439,null,"ノートブック"]
["環境_国際_コンピュータ_ワークステーション","ワークステーション","Work station","環境_国際_コンピュータ",4,440,null,"ワークステーション"]
["環境_国際_コンピュータ_小型サーバー","小型サーバー","Small sized server","環境_国際_コンピュータ",4,441,null,"小型サーバー"]
["環境_国際_コンピュータ_シンクライアント","シンクライアント","This client","環境_国際_コンピュータ",4,442,null,"シンクライアント"]
["環境_国際_ディスプレイ","ディスプレイ類","Displays","環境_国際",3,443,null,"ディスプレイ類"]
["環境_国際_ディスプレイ_CRTディスプレイ","CRTディスプレイ","CRT Displays","環境_国際_ディスプレイ",4,444,null,"CRTディスプレイ"]
["環境_国際_ディスプレイ_30インチ未満","30インチ未満","Below 30 inch","環境_国際_ディスプレイ",4,445,null,"30インチ未満"]
["環境_国際_ディスプレイ_30インチ以上","30インチ以上","30 inch and above","環境_国際_ディスプレイ",4,446,null,"30インチ以上"]
["環境_国際_ディスプレイ_固定画素ディスプレイ","固定画素ディスプレイ","Fixed pixel display","環境_国際_ディスプレイ",4,447,null,"固定画素ディスプレイ"]
["環境_国際_画像機器","画像機器類","AV equipments","環境",2,448,null,"画像機器類"]
["環境_国際_画像機器_プリンタ","プリンタ","Printer","環境_国際_画像機器",3,449,null,"プリンタ"]
["環境_国際_画像機器_ファクシミリ","ファクシミリ","Facsimile","環境_国際_画像機器",3,450,null,"ファクシミリ"]
["環境_国際_画像機器_複写機","複写機","Copier","環境_国際_画像機器",3,451,null,"複写機"]
["環境_国際_画像機器_スキャナ","スキャナ","Scanner","環境_国際_画像機器",3,452,null,"スキャナ"]
["環境_国際_画像機器_複合機","複合機","Multi-Function","環境_国際_画像機器",3,453,null,"複合機"]
["環境_国際_画像機器_ディジタル印刷機","ディジタル印刷機","Digital printer","環境_国際_画像機器",3,454,null,"ディジタル印刷機"]
["環境_米国","米国エネルギースタープログラム運用細則","USA Energy Star program operational byelaw","環境",2,455,null,"米国エネルギースタープログラム"]
["環境_米国_コンピュータ","コンピュータ","PC","環境_米国",3,456,null,"コンピュータ類"]
["環境_米国_コンピュータ_デスクトップ","デスクトップ","Desk top","環境_米国_コンピュータ",4,457,null,"デスクトップ"]
["環境_米国_コンピュータ_一体型デスクトップ","一体型デスクトップ","All-in-one desk top","環境_米国_コンピュータ",4,458,null,"一体型デスクトップ"]
["環境_米国_コンピュータ_ノートブック","ノートブック","Note book","環境_米国_コンピュータ",4,459,null,"ノートブック"]
["環境_米国_コンピュータ_ワークステーション","ワークステーション","Workstation","環境_米国_コンピュータ",4,460,null,"ワークステーション"]
["環境_米国_コンピュータ_小型サーバー","小型サーバー","Small sized server","環境_米国_コンピュータ",4,461,null,"小型サーバー"]
["環境_米国_コンピュータ_シンクライアント","シンクライアント","Thin client","環境_米国_コンピュータ",4,462,null,"シンクライアント"]
["環境_米国_ディスプレイ","ディスプレイ","Display","環境_米国",3,463,null,"ディスプレイ類"]
["環境_米国_ディスプレイ_CRTディスプレイ","CRTディスプレイ","CRT Displays","環境_米国_ディスプレイ",4,464,null,"CRTディスプレイ"]
["環境_米国_ディスプレイ_30インチ未満","30インチ未満","Below 30 inch","環境_米国_ディスプレイ",4,465,null,"30インチ未満"]
["環境_米国_ディスプレイ_30インチ以上","30インチ以上","30 inch and above","環境_米国_ディスプレイ",4,466,null,"30インチ以上"]
["環境_米国_ディスプレイ_固定画素ディスプレイ","固定画素ディスプレイ","Fixed pixel display","環境_米国_ディスプレイ",4,467,null,"固定画素ディスプレイ"]
["環境_米国_画像機器","画像機器","AV equipments","環境_米国",3,468,null,"画像機器類"]
["環境_米国_画像機器_プリンタ","プリンタ","Printer","環境_米国_画像機器",4,469,null,"プリンタ"]
["環境_米国_画像機器_ファクシミリ","ファクシミリ","Facsimile","環境_米国_画像機器",4,470,null,"ファクシミリ"]
["環境_米国_画像機器_複写機","複写機","Copier","環境_米国_画像機器",4,471,null,"複写機"]
["環境_米国_画像機器_スキャナ","スキャナ","Scanner","環境_米国_画像機器",4,472,null,"スキャナ"]
["環境_米国_画像機器_複合機","複合機","Multi-Function","環境_米国_画像機器",4,473,null,"複合機"]
["環境_米国_画像機器_ディジタル印刷機","ディジタル印刷機","Digital printer","環境_米国_画像機器",4,474,null,"ディジタル印刷機"]
["環境_米国_画像機器_郵便機器","郵便機器","Mailing equipment","環境_米国_画像機器",4,475,null,"郵便機器"]
["環境_米国_テレビジョン受信機","テレビジョン受信機","TV receiver","環境_米国",3,476,null,"テレビジョン受信機"]
["環境_米国_コンピューターサーバー","コンピューターサーバー","Computer server","環境_米国",3,477,null,"コンピューターサーバー"]
["環境_米国_電話機器","電話機器","Telephone equipment","環境_米国",3,478,null,"電話機器"]
["環境_エネルギーラベル","エネルギーラベル","Energy Label","環境",2,479,null,"エネルギーラベル"]
["環境_エネルギーラベル_家庭用冷蔵庫/冷凍庫","家庭用冷蔵庫/冷凍庫","Household refrigerating appliances","環境_エネルギーラベル",3,480,null,"家庭用冷蔵庫/冷凍庫"]
["環境_エネルギーラベル_家庭用冷蔵庫/冷凍庫_IEC62552","IEC62552","IEC62552","環境_エネルギーラベル_家庭用冷蔵庫/冷凍庫",4,481,null,"IEC62552"]
["環境_エネルギーラベル_家庭用冷蔵庫/冷凍庫_JIS_C_9801","JIS C_9801","JIS C_9801","環境_エネルギーラベル_家庭用冷蔵庫/冷凍庫",4,482,null,"JIS C 9801"]
["環境_エネルギーラベル_家庭用冷蔵庫/冷凍庫_JIS_B_8630","JIS B_8630","JIS B_8630","環境_エネルギーラベル_家庭用冷蔵庫/冷凍庫",4,483,null,"JIS B 8630"]
["製品安全試験","製品安全試験","Products safety","試験規格",1,484,null,"23．試験規格－製品安全（注：本項を申請する場合は、事前にVLACにご相談ください。）"]
["製品安全試験_IEC","IEC製品安全規格に基づく耐電圧試験及び漏れ電流測定","Withstand voltage test and leakage current measurement based on IEC products safety standards","製品安全試験",2,485,null,"IEC製品安全規格に基づく耐電圧試験及び漏れ電流測定"]
["製品安全試験_IEC_家電製品","家電製品","Home appliance","製品安全試験_IEC",3,486,null,"家電製品"]
["製品安全試験_IEC_家電製品_IEC60335-1","IEC60335-1","IEC60335-1","製品安全試験_IEC_家電製品",4,487,null,"IEC60335-1シリーズ"]
["製品安全試験_IEC_家電製品_IEC60335-2","IEC60335-2","IEC60335-2","製品安全試験_IEC_家電製品",4,488,null,"IEC60335-2シリーズ"]
["製品安全試験_IEC_家電製品_EN60335-1","EN 60335-1","EN 60335-1","製品安全試験_IEC_家電製品",4,489,null,"EN 60335-1シリーズ"]
["製品安全試験_IEC_家電製品_EN60335-2","EN 60335-2","EN 60335-2","製品安全試験_IEC_家電製品",4,490,null,"EN 60335-2シリーズ"]
["製品安全試験_IEC_家電製品_JIS_C_90335-1","JIS C_90335-1","JIS C_90335-1","製品安全試験_IEC_家電製品",4,491,null,"JIS C 90335-1シリーズ"]
["製品安全試験_IEC_家電製品_JIS_C_90335-2","JIS C_90335-2","JIS C_90335-2","製品安全試験_IEC_家電製品",4,492,null,"JIS C 90335-2シリーズ"]
["製品安全試験_IEC_IT機器","IT機器","IT Equipments","製品安全試験_IEC",3,493,null,"IT機器"]
["製品安全試験_IEC_IT機器_IEC60950-1","IEC60950-1","IEC60950-1","製品安全試験_IEC_IT機器",4,494,null,"IEC 60950-1"]
["製品安全試験_IEC_IT機器_EN60950-1","EN 60950-1","EN 60950-1","製品安全試験_IEC_IT機器",4,495,null,"EN 60950-1"]
["製品安全試験_IEC_IT機器_JIS_C_60950-1","JIS C_60950-1","JIS C_60950-1","製品安全試験_IEC_IT機器",4,496,null,"JIS C60950-1"]
["製品安全試験_IEC_AV機器","AV機器","AV equipments","製品安全試験_IEC",3,497,null,"AV機器"]
["製品安全試験_IEC_AV機器_IEC60065","IEC60065","IEC60065","製品安全試験_IEC_AV機器",4,498,null,"IEC 60065"]
["製品安全試験_IEC_AV機器_EN60065","EN60065","IEC60065","製品安全試験_IEC_AV機器",4,499,null,"EN 60065"]
["製品安全試験_IEC_AV機器_JIS_C_6065","JIS C_6065","JIS C_6065","製品安全試験_IEC_AV機器",4,500,null,"JIS C6065"]
["製品安全試験_IEC_医用電気機器","医用電気機器","Medical electrical equipment","製品安全試験_IEC",3,501,null,"医用電気機器"]
["製品安全試験_IEC_医用電気機器_IEC60601-1","IEC60601-1","IEC60601-1","製品安全試験_IEC_医用電気機器",4,502,null,"IEC 60601-1シリーズ"]
["製品安全試験_IEC_医用電気機器_IEC60601-2","IEC60601-2","IEC60601-2","製品安全試験_IEC_医用電気機器",4,503,null,"IEC 60601-2シリーズ"]
["製品安全試験_IEC_医用電気機器_EN60601-1","EN 60601-1","EN 60601-1","製品安全試験_IEC_医用電気機器",4,504,null,"EN 60601-1シリーズ"]
["製品安全試験_IEC_医用電気機器_EN60601-2","EN 60601-2","EN 60601-2","製品安全試験_IEC_医用電気機器",4,505,null,"EN 60601-2シリーズ"]
["製品安全試験_IEC_医用電気機器_JIS_T0601-1","JIS T0601-1","JIS T0601-1","製品安全試験_IEC_医用電気機器",4,506,null,"JIS T0601-1シリーズ"]
["製品安全試験_IEC_医用電気機器_JIS_T0601-2","JIS T0601-2","JIS T0601-2","製品安全試験_IEC_医用電気機器",4,507,null,"JIS T0601-2シリーズ"]
["製品安全試験_IEC_制御機器計測機器","制御機器・計測機器","electrical equipment for measurement, control, and laboratory use","製品安全試験_IEC",3,508,null,"制御機器・計測機器"]
["製品安全試験_IEC_制御機器計測機器_IEC61010-1","IEC61010-1","IEC61010-1","製品安全試験_IEC_制御機器計測機器",4,509,null,"IEC 61010-1シリーズ"]
["製品安全試験_IEC_制御機器計測機器_IEC61010-2","IEC61010-2","IEC61010-2","製品安全試験_IEC_制御機器計測機器",4,510,null,"IEC 61010-2シリーズ"]
["製品安全試験_IEC_制御機器計測機器_EN61010-1","EN 61010-1","EN 61010-1","製品安全試験_IEC_制御機器計測機器",4,511,null,"EN 61010-1シリーズ"]
["製品安全試験_IEC_制御機器計測機器_EN61010-2","EN 61010-2","EN 61010-2","製品安全試験_IEC_制御機器計測機器",4,512,null,"EN 61010-2シリーズ"]
["製品安全試験_IEC_制御機器計測機器_JIS_C_1010-1","JIS C_1010-1","JIS C_1010-1","製品安全試験_IEC_制御機器計測機器",4,513,null,"JIS C1010-1シリーズ"]
["製品安全試験_IEC_制御機器計測機器_JIS_C_1010-2","JIS C_1010-2","JIS C_1010-2","製品安全試験_IEC_制御機器計測機器",4,514,null,"JIS C1010-2シリーズ"]

{"sheet":"設定_試験項目","index":15,"n_rows":55,"n_cols":10,"rows_kept":55,"hidden":true}
[]
[]
[]
["項番","タイトル","階層","表示非表示","表示タイプ","枝番入力","親試験項目フラグ","試験項目コード","表示順","備考"]
[1,"エミッション",1,0,0,null,1,"項目_エミ",1]
[2,"放射妨害波（FCC、CISPR11関連規格の1GHz超試験を含む）",2,0,0,null,0,"項目_エミ_放射妨害波",2]
[3,"伝導妨害波",2,0,0,null,0,"項目_エミ_伝導妨害波",3]
[4,"イミュニティ",1,0,0,null,1,"項目_イミ",4]
[5,"静電気",2,0,0,null,0,"項目_イミ_静電気",5]
[6,"放射電磁界",2,0,0,null,0,"項目_イミ_放射電磁界",6]
[7,"放射磁界",2,0,0,null,0,"項目_イミ_放射磁界",7]
[8,"電気的過度バースト",2,0,0,null,0,"項目_イミ_電気的過渡バースト",8]
[9,"サージ",2,0,0,null,0,"項目_イミ_サージ",9]
[10,"無線周波伝導妨害波",2,0,0,null,0,"項目_イミ_無線周波伝導妨害",10]
[11,"電源電圧変動",2,0,0,null,0,"項目_イミ_電源電圧変動",11]
[12,"1GHz超放射妨害波エミッション(CISPR22関連規格, VCCI技術基準による1GHz超の試験）",1,0,0,null,1,"項目_1GHz超放射妨害波エミ",12]
[13,"放送受信機イミュニティ",1,0,0,null,1,"項目_放送受信機イミ",13]
[14,"アンテナ端子",2,0,0,null,0,"項目_放送受信機イミ_アンテナ端子",14]
[15,"電源端子無線周波伝導妨害波",2,0,0,null,0,"項目_放送受信機イミ_電源端子",15]
[16,"筐体放射電磁界",2,0,0,null,0,"項目_放送受信機イミ_筺体放射電磁界",16]
[17,"放送受信機エミッション",1,0,0,null,1,"項目_放送受信機エミ",17]
[18,"放射妨害波",2,0,0,null,0,"項目_放送受信機エミ_放射妨害波",18]
[19,"伝導妨害波",2,0,0,null,0,"項目_放送受信機エミ_伝導妨害波",19]
[20,"電力送電機器イミュニティ",1,0,0,null,1,"項目_電力送電機器イミ",20]
[21,"減衰振動波",2,0,0,null,0,"項目_電力送電機器イミ_減衰振動波",21]
[22,"リング振動波",2,0,0,null,0,"項目_電力送電機器イミ_リング振動波",22]
[23,"直流入力ポートリップル印加",2,0,0,null,0,"項目_電力送電機器イミ_直流入力ポートリップル印加",23]
[24,"電源高調波",1,0,0,null,1,"項目_電源高調波",24]
[25,"高調波電流",2,0,0,null,0,"項目_電源高調波_高調波電流",25]
[26,"電源電圧動揺",2,0,0,null,0,"項目_電源高調波_電源電圧動揺",26]
[27,"自動車・車載機器",1,0,0,null,1,"項目_自動車車載機器",27]
[28,"ESA(車載部品)イミュニティ",2,0,0,null,0,"項目_自動車車載機器_ESA(車載部品)イミュニティ",28]
[29,"ESA(車載部品)エミッション",2,0,0,null,0,"項目_自動車車載機器_ESA(車載部品)エミッション",29]
[30,"自動車イミュニティ",2,0,0,null,0,"項目_自動車車載機器_自動車イミュニティ",30]
[31,"自動車エミッション",2,0,0,null,0,"項目_自動車車載機器_自動車エミッション",31]
[32,"音響(空気伝搬騒音)",1,0,0,null,1,"項目_空気伝搬騒音",32]
[33,"通信機器性能１",1,0,0,null,1,"項目_通信機器1",33]
[34,"送信電力",2,0,0,null,0,"項目_通信機器1_送信電力",34]
[35,"スプリアス",2,0,0,null,0,"項目_通信機器1_スプリアス",35]
[36,"信号特性",2,0,0,null,0,"項目_通信機器1_信号特性",36]
[37,"通信機器性能2",1,0,0,null,1,"項目_通信機器2",37]
[38,"電磁界ばく露(局所比吸収率)",2,0,0,null,0,"項目_通信機器2_電磁界ばく露_局所比吸収率",38]
[39,"電磁界ばく露(磁界強度)",2,0,0,null,0,"項目_通信機器2_電磁界ばく露_磁界強度",39]
[40,"通信機器性能3",1,0,0,null,1,"項目_通信機器3",40]
[41,"公衆回線接続通信端末機器試験",2,0,0,null,0,"項目_通信機器3_有線通信機器",41]
[42,"環境",1,0,0,null,1,"項目_環境",42]
[43,"国際エネルギースタープログラム",2,0,0,null,0,"項目_環境_国際エネルギースタープログラム",43]
[44,"米国エネルギースタープログラム",2,0,0,null,0,"項目_環境_消費電力",44]
[45,"消費電力",2,0,0,null,0,"項目_環境_米国エネルギースタープログラム",45]
[46,"製品安全",1,0,0,null,1,"項目_製品安全",46]
[47,"家電製品",2,0,0,null,0,"項目_製品安全_家電製品",47]
[48,"IT機器",2,0,0,null,0,"項目_製品安全_IT機器",48]
[49,"AV機器",2,0,0,null,0,"項目_製品安全_AV機器",49]
[50,"医用電気機器",2,0,0,null,0,"項目_製品安全_医用電気機器",50]
[55,"制御機器・計測機器",2,0,0,null,0,"項目_製品安全_制御機器計測機器",51]

{"sheet":"設定_試験区分","index":16,"n_rows":192,"n_cols":11,"rows_kept":192,"hidden":true}
[]
[]
[]
["項番","タイトル","階層","表示非表示","表示タイプ","測定周波数範囲","親試験区分フラグ","試験区分コード","表示順","備考","検査用VLOOKUP用"]
[1,"5．試験区分－電磁両立性 エミッション",1,0,0,null,1,"エミ"]
[2,"5.1．放射妨害波 （エンクロージャーポート）",2,0,0,null,0,"エミ_放射_エンク"]
[3,"放射妨害波電界強度試験",3,0,0,null,0,"エミ_放射_エンク_妨害電界"]
[4,"基準大地面上（付属書：VF102またはVF103）",4,0,0,null,0,"エミ_放射_エンク_妨害電界_基準"]
[5,"FCC, CISPR11関連の1GHz超試験も含む",5,0,1,null,0]
[6,"測定周波数範囲：30MHz～",5,0,4,"@[O-3]@GHz",0,"エミ_放射_エンク_妨害電界_基準_測定周波数範囲"]
[7,"基準大地面上：車載機器試験(1m法)（付属書：VF170）",4,0,0,null,0,"エミ_放射_エンク_妨害電界_基準_車載機器"]
[8,"測定周波数範囲：",5,0,4,"@[M-3]@kHz～@[R-3]@GHz",0,"エミ_放射_エンク_妨害電界_基準_車載機器_測定周波数範囲"]
[9,"準自由空間（付属書：VF-152）",4,0,0,null,0,"エミ_放射_エンク_妨害電界_準自由_VF152"]
[10,"VCCI技術基準V-3、CISPR22/32関連規格、ANSI C63.4:2014を含む場合に適用",5,0,1,null,0]
[11,"測定周波数範囲：1GHz～",5,0,4,"@[O-3]@GHz",0,"エミ_放射_エンク_妨害電界_準自由_VF152_1GHz"]
[12,"準自由空間（付属書：VF-153）",4,0,0,null,0,"エミ_放射_エンク_妨害電界_準自由_VF153"]
[13,"測定周波数範囲：（",5,0,4,"@[M-5]@～@[S-5]@）",0,"エミ_放射_エンク_妨害電界_準自由_VF153_測定周波数範囲"]
[14,"放射妨害波磁界強度試験",3,0,0,null,0,"エミ_放射_エンク_妨害磁界"]
[15,"ループアンテナ",4,0,0,null,0,"エミ_放射_エンク_妨害磁界_ループアンテナ"]
[16,"3軸ループ（ラージループ）",4,0,0,null,0,"エミ_放射_エンク_妨害磁界_3軸ループ"]
[17,"等方性プローブ",4,0,0,null,0,"エミ_放射_エンク_妨害磁界_等方性プローブ"]
[18,"その他の放射妨害波試験",3,0,0,null,0,"エミ_放射_エンク_その他放射妨害波試験"]
[19,"5.2．妨害波電力試験（AC電源ポート）",2,0,0,null,0,"エミ_放射_エンク_妨害電力"]
[20,"吸収クランプ (CMAD)",3,0,0,null,0,"エミ_放射_エンク_妨害電力_CMAD_クランプ"]
[21,"5.3．AC電源ポート伝導妨害波試験（付属書：VF104）",2,0,0,null,0,"エミ_伝導_AC電源"]
[22,"妨害波電圧試験",3,0,0,null,0,"エミ_伝導_AC電源_妨害電圧"]
[23,"AMN",4,0,0,null,0,"エミ_伝導_AC電源_妨害電圧_AMN"]
[24,"高インピーダンスプローブ",4,0,0,null,0,"エミ_伝導_AC電源_妨害電圧_高インピーダンスプローブ"]
[25,"5.4．通信ポート伝導妨害波試験（付属書：VF117）",2,0,0,null,0,"エミ_伝導_通信"]
[26,"妨害波電圧試験",3,0,0,null,0,"エミ_伝導_通信_妨害電圧"]
[27,"AAN",4,0,0,null,0,"エミ_伝導_通信_妨害電圧_AAN"]
[28,"容量性電圧プローブ",4,0,0,null,0,"エミ_伝導_通信_妨害電圧_容量性電圧プローブ"]
[29,"妨害波電流試験",3,0,0,null,0,"エミ_伝導_通信_妨害電流"]
[30,"電流プローブ",4,0,0,null,0,"エミ_伝導_通信_妨害電流_電流プローブ"]
[31,"5.5．DC電源ポート伝導妨害波試験 （付属書：VF171）",2,0,0,null,0,"エミ_伝導_DC電源"]
[32,"妨害波電圧試験",3,0,0,null,0,"エミ_伝導_DC電源_妨害電圧"]
[33,"AMN",4,0,0,null,0,"エミ_伝導_DC電源_妨害電圧_AMN"]
[34,"高インピーダンスプローブ",4,0,0,null,0,"エミ_伝導_DC電源_妨害電圧_高インピーダンスプローブ"]
[35,"車載機器伝導妨害波試験",3,0,0,null,0,"エミ_伝導_DC電源_車載機器"]
[36,"5.6．PLCポート伝導妨害波試験",2,0,0,null,0,"エミ_伝導_PLC"]
[37,"妨害波電流試験",3,0,0,null,0,"エミ_伝導_PLC_妨害電流"]
[38,"電流プローブ",4,0,0,null,0,"エミ_伝導_PLC_妨害電流_電流プローブ"]
[39,"5.7．アンテナポート、RFモジュレーター出力ポート、チューナポート、ファイバーポート伝導妨害波試験（付属書：VF117）",2,0,0,null,0,"エミ_アンテナ"]
[40,"妨害波電圧試験",3,0,0,null,0,"エミ_アンテナ_妨害電圧"]
[41,"AAN",4,0,0,null,0,"エミ_アンテナ_妨害電圧_AAN"]
[42,"容量性電圧プローブ",4,0,0,null,0,"エミ_アンテナ_妨害電圧_容量性電圧プローブ"]
[43,"妨害波電流試験",3,0,0,null,0,"エミ_アンテナ_妨害電流"]
[44,"電流プローブ",4,0,0,null,0,"エミ_アンテナ_妨害電流_妨害電流_電流プローブ"]
[45,"希望信号電圧および妨害波端子電圧試験",3,0,0,null,0,"エミ_アンテナ_希望信号電圧および妨害端子電圧試験"]
[46,"選択性高周波電圧計",4,0,0,null,0,"エミ_アンテナ_希望信号電圧および妨害端子電圧試験_選択性高周波電圧計"]
[47,"屋外ユニット局部発振放射電力試験",3,0,0,null,0,"エミ_アンテナ_屋外ユニット局部発振放射電力試験"]
[48,"6．試験区分－電磁両立性イミュニティ",1,0,0,null,1,"イミ"]
[49,"6.1．静電気（VF128A）",2,0,0,null,0,"イミ_静電気"]
[50,"静電気放電試験",3,0,0,null,0,"イミ_静電気_静電気放電"]
[51,"IEC 61000-4-2/EN 61000-4-2",3,0,0,null,0,"イミ_静電気_IEC61000_4_2"]
[52,"ISO 10605",3,0,0,null,0,"イミ_静電気_ISO_10605"]
[53,"6.2．放射電磁界",2,0,0,null,0,"イミ_放射電磁界"]
[54,"放射電磁界イミュニティ試験(擬似自由空間アンテナ放射) (VF128B)",3,0,0,null,0,"イミ_放射電磁界_放射電磁界イミ_疑似自由空間アンテナ放射"]
[55,"IEC 61000-4-3/EN 61000-4-3　測定周波数範囲：（",4,0,4,"@[V-5]@～@[AB-5]@）",0,"イミ_放射電磁界_放射電磁界イミ_疑似自由空間アンテナ放射_IEC_61000_4_3"]
[56,"IEC 61000-4-22/EN 61000-4-22　測定周波数範囲：（",4,0,4,"@[W-5]@～@[AC-5]@）",0,"イミ_放射電磁界_放射電磁界イミ_疑似自由空間アンテナ放射_IEC_61000_4_22"]
[57,"ISO 11452-2　測定周波数範囲：（",4,0,4,"@[Q-5]@～@[W-5]@）",0,"イミ_放射電磁界_放射電磁界イミ_疑似自由空間アンテナ放射_ISO_11452_2"]
[58,"放射電磁界イミュニティ試験（TEMセル、ストリップライン）（VF128B-TEM）",3,0,0,null,0,"イミ_放射電磁界_放射電磁界イミ_TEMセル"]
[59,"IEC 61000-4-20/EN 61000-4-20　測定周波数範囲：（",4,0,4,"@[W-5]@～@[AC-5]@）",0,"イミ_放射電磁界_放射電磁界イミ_TEMセル_IEC_61000_4_20"]
[60,"ISO 11452-3　測定周波数範囲：（",4,0,4,"@[Q-5]@～@[W-5]@）",0,"イミ_放射電磁界_放射電磁界イミ_TEMセル_ISO_11452_3"]
[61,"ISO 11452-5　測定周波数範囲：（",4,0,4,"@[P-5]@～@[V-5]@）",0,"イミ_放射電磁界_放射電磁界イミ_TEMセル_ISO_11452_5"]
[62,"放射電磁界イミュニティ試験（反射箱）（VF128B-RVC）",3,0,0,null,0,"イミ_放射電磁界_放射電磁界イミ_反射箱"]
[63,"IEC 61000-4-21/EN 61000-4-21　測定周波数範囲：（",4,0,4,"@[W-5]@～@[AC-5]@）",0,"イミ_放射電磁界_放射電磁界イミ_反射箱_IEC_61000_4_21"]
[64,"6.3．電気的過渡バースト （VF128C）",2,0,0,null,0,"イミ_電気的過渡バースト"]
[65,"IEC 61000-4-4/EN 61000-4-4",3,0,0,null,0,"イミ_電気的過渡バースト_IEC_61000_4_4"]
[66,"電源ポート伝導イミュニティ試験",4,0,0,null,0,"イミ_電気的過渡バースト_電源ポート伝導イミ"]
[67,"通信／信号ポート伝導イミュニティ試験",4,0,0,null,0,"イミ_電気的過渡バースト_通信_信号ポート伝導イミ"]
[68,"ISO 7637-2 （CDN）",3,0,0,null,0,"イミ_電気的過渡バースト_ISO_7637_2"]
[69,"ISO 7637-3　（容量性結合器）",3,0,0,null,0,"イミ_電気的過渡バースト_ISO_7637_3"]
[70,"6.4．サージ  （VF128D）",2,0,0,null,0,"イミ_サージ"]
[71,"IEC 61000-4-5/EN 61000-4-5",3,0,0,null,0,"イミ_サージ_IEC_61000_4_5"]
[72,"電源ポートサージイミュニティ試験",4,0,0,null,0,"イミ_サージ_電源ポートサージイミ"]
[73,"通信／信号ポートサージイミュニティ試験",4,0,0,null,0,"イミ_サージ_通信_信号ポートサージイミ"]
[74,"6.5．無線周波伝導妨害波 （VF128E）",2,0,0,null,0,"イミ_無線周波伝導妨害"]
[75,"IEC 61000-4-6/EN 61000-4-6",3,0,0,null,0,"イミ_無線周波伝導妨害_IEC_61000_4_6"]
[76,"IEC 61000-4-16/EN 61000-4-16",3,0,0,null,0,"イミ_無線周波伝導妨害_IEC_61000_4_16"]
[77,"電源ポート無線周波伝導イミュニティ試験　測定周波数範囲：（",4,0,4,"@[Y-5]@～@[AE-5]@）",0,"イミ_無線周波伝導妨害_電源ポート無線周波伝導イミ"]
[78,"通信／信号ポート無線周波伝導イミュニティ試験　測定周波数範囲：（",4,0,4,"@[AA-5]@～@[AG-5]@）",0,"イミ_無線周波伝導妨害_通信_信号ポート無線周波伝導イミ"]
[79,"ISO 11452-4　測定周波数範囲：（",4,0,4,"@[Q-5]@～@[W-5]@）",0,"イミ_無線周波伝導妨害_ISO_11452_4"]
[80,"ISO 11452-9　測定周波数範囲：（",4,0,4,"@[Q-5]@～@[W-5]@）",0,"イミ_無線周波伝導妨害_ISO_11452_9"]
[81,"6.6．放射磁界 （VF128F）",2,0,0,null,0,"イミ_放射磁界"]
[82,"磁界イミュニティ試験（ループコイル、ヘルムホルツコイル）",3,0,0,null,0,"イミ_放射磁界_電源周波数磁界イミ"]
[83,"IEC 61000-4-8/EN 61000-4-8",4,0,0,null,0,"イミ_放射磁界_電源周波数磁界イミ_IEC_61000_4_8"]
[84,"IEC 61000-4-9/EN 61000-4-9",4,0,0,null,0,"イミ_放射磁界_電源周波数磁界イミ_IEC_61000_4_9"]
[85,"ISO 11452-8",4,0,0,null,0,"イミ_放射磁界_電源周波数磁界イミ_ISO_11452_8"]
[86,"6.7．電源電圧変動 （VF128G）",2,0,0,null,0,"イミ_電源電圧変動"]
[87,"電源電圧ディップ・瞬停試験",3,0,0,null,0,"イミ_電源電圧変動_電源電圧ディップ瞬停"]
[88,"IEC 61000-4-11/EN 61000-4-11",4,0,0,null,0,"イミ_電源電圧変動_電源電圧ディップ瞬停_IEC_61000_4_11"]
[89,"IEC 61000-4-29/EN 61000-4-29",4,0,0,null,0,"イミ_電源電圧変動_電源電圧ディップ瞬停_IEC_61000_4_29"]
[90,"6.8．放送受信機イミュニティ",2,0,0,null,0,"イミ_放送受信機イミ"]
[91,"2信号または3信号特性試験（S1）",3,0,0,null,0,"イミ_放送受信機イミ_アンテナ端子_2信号または3信号特性"]
[92,"電源ポート無線周波伝導妨害波試験（S2）",3,0,0,null,0,"イミ_放送受信機イミ_電源端子無線周波伝導妨害_電源ポート"]
[93,"電磁界イミュニティ試験（オープンストリップライン）（S3）",3,0,0,null,0,"イミ_放送受信機イミ_放射電磁界_電磁界イミ_オープンストリップライン"]
[94,"同軸遮蔽減衰量試験（S4）",3,0,0,null,0,"イミ_放送受信機イミ_アンテナ端子_同軸遮蔽減衰量"]
[95,"6.9．電力送電機器イミュニティ",2,0,0,null,0,"イミ_電力送電機器イミュニティ"]
[96,"減衰振動波",3,0,0,null,0,"イミ_電力送電機器イミュニティ_減衰振動波"]
[97,"リング振動波",3,0,0,null,0,"イミ_電力送電機器イミュニティ_リング振動波"]
[98,"直流入力ポートリップル印加",3,0,0,null,0,"イミ_電力送電機器イミュニティ_直流入力ポートリップル印加"]
[99,"7．試験区分－電源高調波",1,0,0,null,1,"電源高調波"]
[100,"7.1．電源高調波歪",2,0,0,null,0,"電源高調波_電源高調波歪"]
[101,"高調波電流試験",3,0,0,null,0,"電源高調波_電源高調波歪_高調波電流"]
[102,"7.2．電源電圧動揺",2,0,0,null,0,"電源高調波_電源電圧動揺"]
[103,"フリッカー試験",3,0,0,null,0,"電源高調波_電源電圧動揺_フリッカー"]
[104,"8．試験区分－音響",1,0,0,null,1,"音響"]
[105,"8.1．空気伝搬騒音",2,0,0,null,0,"音響_空気伝搬騒音"]
[106,"空気伝搬騒音試験（付属書：VF154）",3,0,0,null,0,"音響_空気伝搬騒音_空気伝搬騒音"]
[107,"9．試験区分－通信機器性能 １",1,0,0,null,1,"通信機器性能"]
[108,"9.1．送信電力",2,0,0,null,0,"通信機器性能_送信電力"]
[109,"アンテナ端子出力電力",3,0,0,null,0,"通信機器性能_送信電力_アンテナ端子出力電力"]
[110,"EIA/TIA-603-C",4,0,0,null,0,"通信機器性能_送信電力_アンテナ端子出力電力_EIA_TIA_603_C"]
[111,"FCC Part2(2.1046)",4,0,0,null,0,"通信機器性能_送信電力_アンテナ端子出力電力_FCC_Part2"]
[112,"放射電力(置換)",3,0,0,null,0,"通信機器性能_送信電力_放射電力_置換"]
[113,"EIA/TIA-603-C",4,0,0,null,0,"通信機器性能_送信電力_放射電力_置換_EIA_TIA_603_C"]
[114,"FCC Part2(2.1053)",4,0,0,null,0,"通信機器性能_送信電力_放射電力_置換_FCC_Part2"]
[115,"9.2．スプリアス",2,0,0,null,0,"通信機器性能_スプリアス"]
[116,"端子電圧（キャリア比）",3,0,0,null,0,"通信機器性能_スプリアス_端子電圧"]
[117,"EIA/TIA-603-C",4,0,0,null,0,"通信機器性能_スプリアス_端子電圧_EIA_TIA_603_C"]
[118,"FCC Part2(2.1051)",4,0,0,null,0,"通信機器性能_スプリアス_端子電圧_FCC_Part2"]
[119,"放射電界強度",3,0,0,null,0,"通信機器性能_スプリアス_放射電界強度"]
[120,"EIA/TIA-603-C",4,0,0,null,0,"通信機器性能_スプリアス_放射電界強度_EIA_TIA_603_C"]
[121,"FCC Part2(2.1053)",4,0,0,null,0,"通信機器性能_スプリアス_放射電界強度_FCC_Part2"]
[122,"9.3．信号特性",2,0,0,null,0,"通信機器性能_信号特性"]
[123,"周波数安定度",3,0,0,null,0,"通信機器性能_信号特性_周波数安定度"]
[124,"EIA/TIA-603-C",4,0,0,null,0,"通信機器性能_信号特性_周波数安定度_EIA_TIA_603_C"]
[125,"FCC Part2(2.1055)",4,0,0,null,0,"通信機器性能_信号特性_周波数安定度_FCC_Part2"]
[126,"変調特性",3,0,0,null,0,"通信機器性能_信号特性_変調特性"]
[127,"EIA/TIA-603-C",4,0,0,null,0,"通信機器性能_信号特性_変調特性_EIA_TIA_603_C"]
[128,"FCC Part2(2.1047)",4,0,0,null,0,"通信機器性能_信号特性_変調特性_FCC_Part2"]
[129,"占有帯域幅",3,0,0,null,0,"通信機器性能_信号特性_占有帯域幅"]
[130,"EIA/TIA-603-C",4,0,0,null,0,"通信機器性能_信号特性_占有帯域幅_EIA_TIA_603_C"]
[131,"FCC Part2(2.1049)",4,0,0,null,0,"通信機器性能_信号特性_占有帯域幅_FCC_Part2"]
[132,"スペクトラム",3,0,0,null,0,"通信機器性能_信号特性_スペクトラム"]
[133,"EIA/TIA-603-C",4,0,0,null,0,"通信機器性能_信号特性_スペクトラム_EIA_TIA_603_C"]
[134,"FCC Part2(2.1057)",4,0,0,null,0,"通信機器性能_信号特性_スペクトラム_FCC_Part2"]
[135,"9.4．その他(FCC15)",2,0,0,null,0,"通信機器性能_その他"]
[136,"動作周波数",3,0,0,null,0,"通信機器性能_その他_動作周波数"]
[137,"ANSI C63.10",4,0,0,null,0,"通信機器性能_その他_動作周波数_ANSI_63_10"]
[138,"FCC Part15C",4,0,0,null,0,"通信機器性能_その他_動作周波数_FCC_Part15_C"]
[139,"周波数安定度",3,0,0,null,0,"通信機器性能_その他_周波数安定度"]
[140,"ANSI C63.10",4,0,0,null,0,"通信機器性能_その他_周波数安定度_ANSI_63_10"]
[141,"FCC Part15C",4,0,0,null,0,"通信機器性能_その他_周波数安定度_FCC_Part15_C"]
[142,"入力電圧",3,0,0,null,0,"通信機器性能_その他_入力電圧"]
[143,"ANSI C63.10",4,0,0,null,0,"通信機器性能_その他_入力電圧_ANSI_63_10"]
[144,"FCC Part15C",4,0,0,null,0,"通信機器性能_その他_入力電圧_FCC_Part15_C"]
[145,"チャンネル占有",3,0,0,null,0,"通信機器性能_その他_チャンネル占有"]
[146,"ANSI C63.10",4,0,0,null,0,"通信機器性能_その他_チャンネル占有_ANSI_63_10"]
[147,"FCC Part15C",4,0,0,null,0,"通信機器性能_その他_チャンネル占有_FCC_Part15_C"]
[148,"スペクトラム密度",3,0,0,null,0,"通信機器性能_その他_スペクトラム密度"]
[149,"ANSI C63.10",4,0,0,null,0,"通信機器性能_その他_スペクトラム密度_ANSI_63_10"]
[150,"FCC Part15C",4,0,0,null,0,"通信機器性能_その他_スペクトラム密度_FCC_Part15_C"]
[151,"アンテナ端子出力電圧",3,0,0,null,0,"通信機器性能_その他_アンテナ端子出力電圧"]
[152,"ANSI C63.10",4,0,0,null,0,"通信機器性能_その他_アンテナ端子出力電圧_ANSI_63_10"]
[153,"ANSI C63.17:1998",4,0,0,null,0,"通信機器性能_その他_アンテナ端子出力電圧_ANSI_63_17_1998"]
[154,"FCC Part15C",4,0,0,null,0,"通信機器性能_その他_アンテナ端子出力電圧_FCC_Part15_C"]
[155,"尖頭伝導送信出力",3,0,0,null,0,"通信機器性能_その他_尖頭伝導送信出力"]
[156,"ANSI C63.10",4,0,0,null,0,"通信機器性能_その他_尖頭伝導送信出力_ANSI_63_10"]
[157,"FCC Part15E",4,0,0,null,0,"通信機器性能_その他_尖頭伝導送信出力_FCC_Part15_E"]
[158,"放射帯域幅",3,0,0,null,0,"通信機器性能_その他_放射帯域幅"]
[159,"ANSI C63.10",4,0,0,null,0,"通信機器性能_その他_放射帯域幅_ANSI_63_10"]
[160,"FCC Part15E",4,0,0,null,0,"通信機器性能_その他_放射帯域幅_FCC_Part15_E"]
[161,"尖頭電力スペクトラム密度",3,0,0,null,0,"通信機器性能_その他_尖頭電力スペクトラム密度"]
[162,"ANSI C63.10",4,0,0,null,0,"通信機器性能_その他_尖頭電力スペクトラム密度_ANSI_63_10"]
[163,"FCC Part15E",4,0,0,null,0,"通信機器性能_その他_尖頭電力スペクトラム密度_FCC_Part15_E"]
[164,"最大偏位",3,0,0,null,0,"通信機器性能_その他_最大偏位"]
[165,"ANSI C63.10",4,0,0,null,0,"通信機器性能_その他_最大偏位_ANSI_63_10"]
[166,"FCC Part15E",4,0,0,null,0,"通信機器性能_その他_最大偏位_FCC_Part15_E"]
[167,"9.5．上記以外の試験",2,0,0,null,0,"通信機器性能_上記以外の試験"]
[168,"欧州規格に基づく試験",3,0,0,null,0,"通信機器性能_上記以外の試験_欧州"]
[169,"カナダ規格に基づく試験",3,0,0,null,0,"通信機器性能_上記以外の試験_カナダ"]
[170,"10．試験区分－通信機器性能 ２",1,0,0,null,1,"通信機器性能2"]
[171,"10.1．電磁界ばく露",2,0,0,null,0,"通信機器性能2_電磁界ばく露"]
[172,"局所吸収率 (付属書：VF119)",3,0,0,null,0,"通信機器性能2_電磁界ばく露_局所比吸収率"]
[173,"磁界強度（磁界プローブ）",3,0,0,null,0,"通信機器性能2_電磁界ばく露_磁界強度_磁界プローブ"]
[174,"電界強度（電界プローブ）",3,0,0,null,0,"通信機器性能2_電磁界ばく露_低周波磁界密度_等方性プローブ"]
[175,"11．試験区分－通信機器性能 ３",1,0,0,null,1,"通信機器性能3"]
[176,"11.1．公衆回線接続通信端末機器試験",2,0,0,null,0,"通信機器性能3_有線通信機器"]
[177,"12．試験区分－環境（消費電力）（注：本項を申請する場合は、事前にVLACにご相談ください。）",1,0,0,null,1,"環境"]
[178,"12.1．消費電力",2,0,0,null,0,"環境_消費電力"]
[179,"標準消費電力量 (TEC)法",3,0,0,null,0,"環境_消費電力_標準消費電力量_TEC法"]
[180,"動作モード (OM)法",3,0,0,null,0,"環境_消費電力_動作モード_OM法"]
[181,"家庭用電気冷蔵庫及び電気冷凍庫の特性及び試験",3,0,0,null,0,"環境_消費電力_家庭用電気冷蔵庫及び電気冷凍庫の特性及び試験"]
[182,"13．試験区分－製品安全試験（注：本項を申請する場合は、事前にVLACにご相談ください。）",1,0,0,null,1,"製品安全"]
[183,"13.1．製品安全試験",2,0,0,null,0,"製品安全_IEC"]
[184,"家電製品",3,0,0,null,0,"製品安全_IEC_家電製品"]
[185,"IT機器",3,0,0,null,0,"製品安全_IEC_IT機器"]
[186,"AV機器",3,0,0,null,0,"製品安全_IEC_AV機器"]
[187,"医用電気機器",3,0,0,null,0,"製品安全_IEC_医用電気機器"]
[188,"制御機器・計測機器",3,0,0,null,0,"製品安全_IEC_制御機器計測機器"]

{"sheet":"設定_試験規格","index":17,"n_rows":410,"n_cols":12,"rows_kept":410,"hidden":true}
[]
[]
[]
["項番","タイトル","階層","表示非表示","表示タイプ","枝番入力","親試験規格フラグ","試験規格コード","表示順","備考","検査用VLOOKUP用","検査用VLOOKUP用"]
[1,"14．試験規格－電磁両立性エミッション",1,0,0,null,1,"エミッション",null,null,{"$f":"VLOOKUP(H5,試験規格マスタ!A:H,2,FALSE)","v":"エミッション試験"},{"$f":"VLOOKUP(B5,試験規格マスタ!H:H,1,FALSE)","v":"14．試験規格－電磁両立性エミッション"}]
[2,"VCCI技術基準 V-3",2,0,0,null,0,"エミッション_VCCI技術基準V-3",null,null,{"$f":"VLOOKUP(H6,試験規格マスタ!A:H,2,FALSE)","v":"VCCI技術基準V-3"},{"$f":"VLOOKUP(B6,試験規格マスタ!H:H,1,FALSE)","v":"VCCI技術基準 V-3"}]
[3,"FCC Part15B　この項にチェックする場合は、申請書の【英文名称入力】シートを入力して下さい。",2,0,0,null,0,"エミッション_FCC_Part15B",null,null,{"$f":"VLOOKUP(H7,試験規格マスタ!A:H,2,FALSE)","v":"FCC Part15B"},{"$f":"VLOOKUP(B7,試験規格マスタ!H:H,1,FALSE)","v":"FCC Part15B　この項にチェックする場合は、申請書の【英文名称入力】シートを入力して下さい。"}]
[4,"Subpart B ITE等、非意図放射機器試験",3,0,0,null,0,"エミッション_FCC_Part15B_SubB_情報処理装置等",null,null,{"$f":"VLOOKUP(H8,試験規格マスタ!A:H,2,FALSE)","v":"Subpart B 情報処理装置等、非意図放射機器試験"},{"$f":"VLOOKUP(B8,試験規格マスタ!H:H,1,FALSE)","v":"Subpart B ITE等、非意図放射機器試験"}]
[5,"ANSI C63.4:2003",4,0,0,null,0,"エミッション_FCC_Part15B_SubB_情報処理装置等_ANSI_63_4_2003",null,null,{"$f":"VLOOKUP(H9,試験規格マスタ!A:H,2,FALSE)","v":"ANSI C63.4:2003"},{"$f":"VLOOKUP(B9,試験規格マスタ!H:H,1,FALSE)","v":{"$error":"#N/A"}}]
[6,"ANSI C63.4:2009",4,0,0,null,0,"エミッション_FCC_Part15B_SubB_情報処理装置等_ANSI_63_4_2009",null,null,{"$f":"VLOOKUP(H10,試験規格マスタ!A:H,2,FALSE)","v":"ANSI C63.4:2009"},{"$f":"VLOOKUP(B10,試験規格マスタ!H:H,1,FALSE)","v":{"$error":"#N/A"}}]
[7,"ANSI C63.4:2014",4,0,0,null,0,"エミッション_FCC_Part15B_SubB_情報処理装置等_ANSI_63_4_2014",null,null,{"$f":"VLOOKUP(H11,試験規格マスタ!A:H,2,FALSE)","v":"ANSI C63.4:2014"},{"$f":"VLOOKUP(B11,試験規格マスタ!H:H,1,FALSE)","v":{"$error":"#N/A"}}]
[8,"Subpart B放送受信機試験",3,0,0,null,0,"エミッション_FCC_Part15B_SubB_放送受信機試験",null,null,{"$f":"VLOOKUP(H12,試験規格マスタ!A:H,2,FALSE)","v":"Subpart B 放送受信機試験"},{"$f":"VLOOKUP(B12,試験規格マスタ!H:H,1,FALSE)","v":"Subpart B放送受信機試験"}]
[9,"ANSI C63.4に基づく放送受信(MP-2を含む)",4,0,0,null,0,"エミッション_FCC_Part15B_SubB_放送受信機試験_放送受信",null,null,{"$f":"VLOOKUP(H13,試験規格マスタ!A:H,2,FALSE)","v":"放送受信(MP-2を含む)"},{"$f":"VLOOKUP(B13,試験規格マスタ!H:H,1,FALSE)","v":"ANSI C63.4に基づく放送受信(MP-2を含む)"}]
[10,"他の受信機",4,0,0,null,0,"エミッション_FCC_Part15B_SubB_放送受信機試験_他の受信機",null,null,{"$f":"VLOOKUP(H14,試験規格マスタ!A:H,2,FALSE)","v":"他の受信機"},{"$f":"VLOOKUP(B14,試験規格マスタ!H:H,1,FALSE)","v":"他の受信機"}]
[11,"FCC Part18 (MP-5)　この項にチェックする場合は、申請書の【英文名称入力】シートを入力して下さい。",2,0,0,null,0,"エミッション_FCC_Part18",null,null,{"$f":"VLOOKUP(H15,試験規格マスタ!A:H,2,FALSE)","v":"FCC_Part18"},{"$f":"VLOOKUP(B15,試験規格マスタ!H:H,1,FALSE)","v":"FCC Part18 (MP-5)　この項にチェックする場合は、申請書の【英文名称入力】シートを入力して下さい。"}]
[12,"CISPR11",2,0,0,null,0,"エミッション_CISPR11",null,null,{"$f":"VLOOKUP(H16,試験規格マスタ!A:H,2,FALSE)","v":"CISPR11"},{"$f":"VLOOKUP(B16,試験規格マスタ!H:H,1,FALSE)","v":"CISPR11"}]
[13,"CISPR12",2,0,0,null,0,"エミッション_CISPR12",null,null,{"$f":"VLOOKUP(H17,試験規格マスタ!A:H,2,FALSE)","v":"CISPR12"},{"$f":"VLOOKUP(B17,試験規格マスタ!H:H,1,FALSE)","v":"CISPR12"}]
[14,"CISPR13",2,1,0,null,0,"エミッション_CISPR13",null,null,{"$f":"VLOOKUP(H18,試験規格マスタ!A:H,2,FALSE)","v":"CISPR13"},{"$f":"VLOOKUP(B18,試験規格マスタ!H:H,1,FALSE)","v":"CISPR13"}]
[15,"CISPR14-1",2,0,0,null,0,"エミッション_CISPR14-1",null,null,{"$f":"VLOOKUP(H19,試験規格マスタ!A:H,2,FALSE)","v":"CISPR14-1"},{"$f":"VLOOKUP(B19,試験規格マスタ!H:H,1,FALSE)","v":"CISPR14-1"}]
[16,"CISPR15",2,0,0,null,0,"エミッション_CISPR15",null,null,{"$f":"VLOOKUP(H20,試験規格マスタ!A:H,2,FALSE)","v":"CISPR15"},{"$f":"VLOOKUP(B20,試験規格マスタ!H:H,1,FALSE)","v":"CISPR15"}]
[17,"CISPR22",2,0,0,null,0,"エミッション_CISPR22",null,null,{"$f":"VLOOKUP(H21,試験規格マスタ!A:H,2,FALSE)","v":"CISPR22"},{"$f":"VLOOKUP(B21,試験規格マスタ!H:H,1,FALSE)","v":"CISPR22"}]
[18,"CISPR25",2,0,0,null,0,"エミッション_CISPR25",null,null,{"$f":"VLOOKUP(H22,試験規格マスタ!A:H,2,FALSE)","v":"CISPR25"},{"$f":"VLOOKUP(B22,試験規格マスタ!H:H,1,FALSE)","v":"CISPR25"}]
[19,"CISPR32",2,0,0,null,0,"エミッション_CISPR32",null,null,{"$f":"VLOOKUP(H23,試験規格マスタ!A:H,2,FALSE)","v":"CISPR32"},{"$f":"VLOOKUP(B23,試験規格マスタ!H:H,1,FALSE)","v":"CISPR32"}]
[20,"EN55011",2,0,0,null,0,"エミッション_EN55011",null,null,{"$f":"VLOOKUP(H24,試験規格マスタ!A:H,2,FALSE)","v":"EN55011"},{"$f":"VLOOKUP(B24,試験規格マスタ!H:H,1,FALSE)","v":"EN55011"}]
[21,"EN55012",2,0,0,null,0,"エミッション_EN55012",null,null,{"$f":"VLOOKUP(H25,試験規格マスタ!A:H,2,FALSE)","v":"EN55012"},{"$f":"VLOOKUP(B25,試験規格マスタ!H:H,1,FALSE)","v":"EN55012"}]
[22,"EN55013",2,1,0,null,0,"エミッション_EN55013",null,null,{"$f":"VLOOKUP(H26,試験規格マスタ!A:H,2,FALSE)","v":"EN55013"},{"$f":"VLOOKUP(B26,試験規格マスタ!H:H,1,FALSE)","v":"EN55013"}]
[23,"EN55014-1",2,0,0,null,0,"エミッション_EN55014-1",null,null,{"$f":"VLOOKUP(H27,試験規格マスタ!A:H,2,FALSE)","v":"EN55014-1"},{"$f":"VLOOKUP(B27,試験規格マスタ!H:H,1,FALSE)","v":"EN55014-1"}]
[24,"EN55015",2,0,0,null,0,"エミッション_EN55015",null,null,{"$f":"VLOOKUP(H28,試験規格マスタ!A:H,2,FALSE)","v":"EN55015"},{"$f":"VLOOKUP(B28,試験規格マスタ!H:H,1,FALSE)","v":"EN55015"}]
[25,"EN55022",2,0,0,null,0,"エミッション_EN55022",null,null,{"$f":"VLOOKUP(H29,試験規格マスタ!A:H,2,FALSE)","v":"EN55022"},{"$f":"VLOOKUP(B29,試験規格マスタ!H:H,1,FALSE)","v":"EN55022"}]
[26,"EN55025",2,0,0,null,0,"エミッション_EN55025",null,null,{"$f":"VLOOKUP(H30,試験規格マスタ!A:H,2,FALSE)","v":"EN55025"},{"$f":"VLOOKUP(B30,試験規格マスタ!H:H,1,FALSE)","v":"EN55025"}]
[27,"EN55032",2,0,0,null,0,"エミッション_EN55032",null,null,{"$f":"VLOOKUP(H31,試験規格マスタ!A:H,2,FALSE)","v":"EN55032"},{"$f":"VLOOKUP(B31,試験規格マスタ!H:H,1,FALSE)","v":"EN55032"}]
[28,"EN55103-1",2,0,0,null,0,"エミッション_EN55103-1",null,null,{"$f":"VLOOKUP(H32,試験規格マスタ!A:H,2,FALSE)","v":"EN55103-1"},{"$f":"VLOOKUP(B32,試験規格マスタ!H:H,1,FALSE)","v":"EN55103-1"}]
[29,"IEC61800-3",2,0,0,null,0,"エミッション_IEC61800-3",null,null,{"$f":"VLOOKUP(H33,試験規格マスタ!A:H,2,FALSE)","v":"IEC61800-3"},{"$f":"VLOOKUP(B33,試験規格マスタ!H:H,1,FALSE)","v":"IEC61800-3"}]
[30,"EN61800-3",2,0,0,null,0,"エミッション_EN61800-3",null,null,{"$f":"VLOOKUP(H34,試験規格マスタ!A:H,2,FALSE)","v":"EN61800-3"},{"$f":"VLOOKUP(B34,試験規格マスタ!H:H,1,FALSE)","v":"EN61800-3"}]
[31,"ISO22199",2,0,0,null,0,"エミッション_ISO22199",null,null,{"$f":"VLOOKUP(H35,試験規格マスタ!A:H,2,FALSE)","v":"ISO22199"},{"$f":"VLOOKUP(B35,試験規格マスタ!H:H,1,FALSE)","v":"ISO22199"}]
[32,"電気用品の雑音の強さの測定方法",2,0,0,null,0,"エミッション_電気用品の雑音の強さの測定方法",null,null,{"$f":"VLOOKUP(H36,試験規格マスタ!A:H,2,FALSE)","v":"エミッション_電気用品の雑音の強さの測定方法"},{"$f":"VLOOKUP(B36,試験規格マスタ!H:H,1,FALSE)","v":"電気用品の雑音の強さの測定方法"}]
[33,"2章",4,0,0,null,0,"エミッション_電気用品の雑音の強さの測定方法_2章",null,null,{"$f":"VLOOKUP(H37,試験規格マスタ!A:H,2,FALSE)","v":"2章"},{"$f":"VLOOKUP(B37,試験規格マスタ!H:H,1,FALSE)","v":"2章"}]
[34,"3章",4,0,0,null,0,"エミッション_電気用品の雑音の強さの測定方法_3章",null,null,{"$f":"VLOOKUP(H38,試験規格マスタ!A:H,2,FALSE)","v":"3章"},{"$f":"VLOOKUP(B38,試験規格マスタ!H:H,1,FALSE)","v":"3章"}]
[35,"4章",4,0,0,null,0,"エミッション_電気用品の雑音の強さの測定方法_4章",null,null,{"$f":"VLOOKUP(H39,試験規格マスタ!A:H,2,FALSE)","v":"4章"},{"$f":"VLOOKUP(B39,試験規格マスタ!H:H,1,FALSE)","v":"4章"}]
[36,"5章",4,0,0,null,0,"エミッション_電気用品の雑音の強さの測定方法_5章",null,null,{"$f":"VLOOKUP(H40,試験規格マスタ!A:H,2,FALSE)","v":"5章"},{"$f":"VLOOKUP(B40,試験規格マスタ!H:H,1,FALSE)","v":"5章"}]
[37,"6章",4,0,0,null,0,"エミッション_電気用品の雑音の強さの測定方法_6章",null,null,{"$f":"VLOOKUP(H41,試験規格マスタ!A:H,2,FALSE)","v":"6章"},{"$f":"VLOOKUP(B41,試験規格マスタ!H:H,1,FALSE)","v":"6章"}]
[38,"7章",4,0,0,null,0,"エミッション_電気用品の雑音の強さの測定方法_7章",null,null,{"$f":"VLOOKUP(H42,試験規格マスタ!A:H,2,FALSE)","v":"7章"},{"$f":"VLOOKUP(B42,試験規格マスタ!H:H,1,FALSE)","v":"7章"}]
[39,"8章",4,0,0,null,0,"エミッション_電気用品の雑音の強さの測定方法_8章",null,null,{"$f":"VLOOKUP(H43,試験規格マスタ!A:H,2,FALSE)","v":"8章"},{"$f":"VLOOKUP(B43,試験規格マスタ!H:H,1,FALSE)","v":"8章"}]
[40,"9章",4,0,0,null,0,"エミッション_電気用品の雑音の強さの測定方法_9章",null,null,{"$f":"VLOOKUP(H44,試験規格マスタ!A:H,2,FALSE)","v":"9章"},{"$f":"VLOOKUP(B44,試験規格マスタ!H:H,1,FALSE)","v":"9章"}]
[41,"J55001",2,0,0,null,0,"エミッション_J55001",null,null,{"$f":"VLOOKUP(H45,試験規格マスタ!A:H,2,FALSE)","v":"J55001"},{"$f":"VLOOKUP(B45,試験規格マスタ!H:H,1,FALSE)","v":"J55001"}]
[42,"J55013",2,1,0,null,0,"エミッション_J55013",null,null,{"$f":"VLOOKUP(H46,試験規格マスタ!A:H,2,FALSE)","v":"J55013"},{"$f":"VLOOKUP(B46,試験規格マスタ!H:H,1,FALSE)","v":"J55013"}]
[43,"J55014-1",2,0,0,null,0,"エミッション_J55014-1",null,null,{"$f":"VLOOKUP(H47,試験規格マスタ!A:H,2,FALSE)","v":"J55014-1"},{"$f":"VLOOKUP(B47,試験規格マスタ!H:H,1,FALSE)","v":"J55014-1"}]
[44,"J55015",2,0,0,null,0,"エミッション_J55015",null,null,{"$f":"VLOOKUP(H48,試験規格マスタ!A:H,2,FALSE)","v":"J55015"},{"$f":"VLOOKUP(B48,試験規格マスタ!H:H,1,FALSE)","v":"J55015"}]
[45,"J55022",2,0,0,null,0,"エミッション_J55022",null,null,{"$f":"VLOOKUP(H49,試験規格マスタ!A:H,2,FALSE)","v":"J55022"},{"$f":"VLOOKUP(B49,試験規格マスタ!H:H,1,FALSE)","v":"J55022"}]
[46,"J55032",2,1,0,null,0,"エミッション_J55032",null,"（目隠し）",{"$f":"VLOOKUP(H50,試験規格マスタ!A:H,2,FALSE)","v":"J55032"},{"$f":"VLOOKUP(B50,試験規格マスタ!H:H,1,FALSE)","v":"J55032"}]
[47,"電波法施行規則",2,0,0,null,0,"エミッション_電波法施行規則",null,null,{"$f":"VLOOKUP(H51,試験規格マスタ!A:H,2,FALSE)","v":"電波法施行規則"},{"$f":"VLOOKUP(B51,試験規格マスタ!H:H,1,FALSE)","v":"電波法施行規則"}]
[48,"第四十六条の二の五（広帯域電力線搬送通信設備）",3,0,0,null,0,"エミッション_電波法施行規則_電波法第46条の2の5",null,null,{"$f":"VLOOKUP(H52,試験規格マスタ!A:H,2,FALSE)","v":"電波法第46条の2の5"},{"$f":"VLOOKUP(B52,試験規格マスタ!H:H,1,FALSE)","v":"第四十六条の二の五（広帯域電力線搬送通信設備）"}]
[49,"第四十六条の七（電子レンジ又は電磁誘導加熱式調理器）",3,0,0,null,0,"エミッション_電波法施行規則_電波法第46条の7",null,null,{"$f":"VLOOKUP(H53,試験規格マスタ!A:H,2,FALSE)","v":"電波法第46条の7"},{"$f":"VLOOKUP(B53,試験規格マスタ!H:H,1,FALSE)","v":"第四十六条の七（電子レンジ又は電磁誘導加熱式調理器）"}]
[50,"AS/NZS CISPR11",2,0,0,null,0,"エミッション_AS_NZS_CISPR11",null,null,{"$f":"VLOOKUP(H54,試験規格マスタ!A:H,2,FALSE)","v":"AS/NZS_CISPR11"},{"$f":"VLOOKUP(B54,試験規格マスタ!H:H,1,FALSE)","v":"AS/NZS CISPR11"}]
[51,"AS/NZS CISPR12",2,0,0,null,0,"エミッション_AS_NZS_CISPR12",null,null,{"$f":"VLOOKUP(H55,試験規格マスタ!A:H,2,FALSE)","v":"AS/NZS_CISPR12"},{"$f":"VLOOKUP(B55,試験規格マスタ!H:H,1,FALSE)","v":"AS/NZS CISPR12"}]
[52,"AS/NZS CISPR13",2,1,0,null,0,"エミッション_AS_NZS_CISPR13",null,null,{"$f":"VLOOKUP(H56,試験規格マスタ!A:H,2,FALSE)","v":"AS/NZS_CISPR13"},{"$f":"VLOOKUP(B56,試験規格マスタ!H:H,1,FALSE)","v":"AS/NZS CISPR13"}]
[53,"AS/NZS CISPR14.1",2,0,0,null,0,"エミッション_AS_NZS_CISPR14-1",null,null,{"$f":"VLOOKUP(H57,試験規格マスタ!A:H,2,FALSE)","v":"AS/NZS_CISPR14-1"},{"$f":"VLOOKUP(B57,試験規格マスタ!H:H,1,FALSE)","v":"AS/NZS CISPR14.1"}]
[54,"AS/NZS CISPR15",2,0,0,null,0,"エミッション_AS_NZS_CISPR15",null,null,{"$f":"VLOOKUP(H58,試験規格マスタ!A:H,2,FALSE)","v":"AS/NZS_CISPR15"},{"$f":"VLOOKUP(B58,試験規格マスタ!H:H,1,FALSE)","v":"AS/NZS CISPR15"}]
[55,"AS/NZS CISPR22",2,0,0,null,0,"エミッション_AS_NZS_CISPR22",null,null,{"$f":"VLOOKUP(H59,試験規格マスタ!A:H,2,FALSE)","v":"AS/NZS_CISPR22"},{"$f":"VLOOKUP(B59,試験規格マスタ!H:H,1,FALSE)","v":"AS/NZS CISPR22"}]
[56,"AS/NZS CISPR25",2,0,0,null,0,"エミッション_AS_NZS_CISPR25",null,null,{"$f":"VLOOKUP(H60,試験規格マスタ!A:H,2,FALSE)","v":"AS/NZS_CISPR25"},{"$f":"VLOOKUP(B60,試験規格マスタ!H:H,1,FALSE)","v":"AS/NZS CISPR25"}]
[57,"AS/NZS CISPR32",2,0,0,null,0,"エミッション_AS_NZS_CISPR32",null,null,{"$f":"VLOOKUP(H61,試験規格マスタ!A:H,2,FALSE)","v":"AS/NZS_CISPR32"},{"$f":"VLOOKUP(B61,試験規格マスタ!H:H,1,FALSE)","v":"AS/NZS CISPR32"}]
[58,"AS/NZS 3200.1.2",2,0,0,null,0,"エミッション_AS_NZS_3200-1-2",null,null,{"$f":"VLOOKUP(H62,試験規格マスタ!A:H,2,FALSE)","v":"AS/NZS_3200-1-2"},{"$f":"VLOOKUP(B62,試験規格マスタ!H:H,1,FALSE)","v":"AS/NZS 3200.1.2"}]
[59,"AS/NZS 61000.6.3",2,0,0,null,0,"エミッション_AS_NZS_61000-6-3",null,null,{"$f":"VLOOKUP(H63,試験規格マスタ!A:H,2,FALSE)","v":"AS/NZS_61000-6-3"},{"$f":"VLOOKUP(B63,試験規格マスタ!H:H,1,FALSE)","v":"AS/NZS 61000.6.3"}]
[60,"AS/NZS 61000.6.4",2,0,0,null,0,"エミッション_AS_NZS_61000-6-4",null,null,{"$f":"VLOOKUP(H64,試験規格マスタ!A:H,2,FALSE)","v":"AS/NZS_61000-6-4"},{"$f":"VLOOKUP(B64,試験規格マスタ!H:H,1,FALSE)","v":"AS/NZS 61000.6.4"}]
[61,"IEC 61131-2",2,0,0,null,0,"エミッション_IEC61131-2",null,null,{"$f":"VLOOKUP(H65,試験規格マスタ!A:H,2,FALSE)","v":"IEC61131-2"},{"$f":"VLOOKUP(B65,試験規格マスタ!H:H,1,FALSE)","v":"IEC 61131-2"}]
[62,"EN 61131-2",2,0,0,null,0,"エミッション_EN61131-2",null,null,{"$f":"VLOOKUP(H66,試験規格マスタ!A:H,2,FALSE)","v":"EN61131-2"},{"$f":"VLOOKUP(B66,試験規格マスタ!H:H,1,FALSE)","v":"EN 61131-2"}]
[63,"ICES-001",2,0,0,null,0,"エミッション_ICES-001",null,null,{"$f":"VLOOKUP(H67,試験規格マスタ!A:H,2,FALSE)","v":"ICES-001"},{"$f":"VLOOKUP(B67,試験規格マスタ!H:H,1,FALSE)","v":"ICES-001"}]
[64,"ICES-002",2,0,0,null,0,"エミッション_ICES-002",null,null,{"$f":"VLOOKUP(H68,試験規格マスタ!A:H,2,FALSE)","v":"ICES-002"},{"$f":"VLOOKUP(B68,試験規格マスタ!H:H,1,FALSE)","v":"ICES-002"}]
[65,"ICES-003",2,0,0,null,0,"エミッション_ICES-003",null,null,{"$f":"VLOOKUP(H69,試験規格マスタ!A:H,2,FALSE)","v":"ICES-003"},{"$f":"VLOOKUP(B69,試験規格マスタ!H:H,1,FALSE)","v":"ICES-003"}]
[66,"ICES-005",2,0,0,null,0,"エミッション_ICES-005",null,null,{"$f":"VLOOKUP(H70,試験規格マスタ!A:H,2,FALSE)","v":"ICES-005"},{"$f":"VLOOKUP(B70,試験規格マスタ!H:H,1,FALSE)","v":"ICES-005"}]
[67,"BETS-7",2,0,0,null,0,"エミッション_BETS-7",null,null,{"$f":"VLOOKUP(H71,試験規格マスタ!A:H,2,FALSE)","v":"BETS-7"},{"$f":"VLOOKUP(B71,試験規格マスタ!H:H,1,FALSE)","v":"BETS-7"}]
[68,"CNS 13803",2,0,0,null,0,"エミッション_CNS13803",null,null,{"$f":"VLOOKUP(H72,試験規格マスタ!A:H,2,FALSE)","v":"CNS13803"},{"$f":"VLOOKUP(B72,試験規格マスタ!H:H,1,FALSE)","v":"CNS 13803"}]
[69,"CNS 13439",2,0,0,null,0,"エミッション_CNS13439",null,null,{"$f":"VLOOKUP(H73,試験規格マスタ!A:H,2,FALSE)","v":"CNS13439"},{"$f":"VLOOKUP(B73,試験規格マスタ!H:H,1,FALSE)","v":"CNS 13439"}]
[70,"CNS 13438",2,0,0,null,0,"エミッション_CNS13438",null,null,{"$f":"VLOOKUP(H74,試験規格マスタ!A:H,2,FALSE)","v":"CNS13438"},{"$f":"VLOOKUP(B74,試験規格マスタ!H:H,1,FALSE)","v":"CNS 13438"}]
[71,"CNS 13783-1",2,0,0,null,0,"エミッション_CNS13783-1",null,null,{"$f":"VLOOKUP(H75,試験規格マスタ!A:H,2,FALSE)","v":"CNS13783-1"},{"$f":"VLOOKUP(B75,試験規格マスタ!H:H,1,FALSE)","v":"CNS 13783-1"}]
[72,"CNS 14115",2,0,0,null,0,"エミッション_CNS14115",null,null,{"$f":"VLOOKUP(H76,試験規格マスタ!A:H,2,FALSE)","v":"CNS14115"},{"$f":"VLOOKUP(B76,試験規格マスタ!H:H,1,FALSE)","v":"CNS 14115"}]
[73,"K00013",2,0,0,null,0,"エミッション_K00013",null,null,{"$f":"VLOOKUP(H77,試験規格マスタ!A:H,2,FALSE)","v":"K00013"},{"$f":"VLOOKUP(B77,試験規格マスタ!H:H,1,FALSE)","v":"K00013"}]
[74,"K00014-1",2,0,0,null,0,"エミッション_K00014-1",null,null,{"$f":"VLOOKUP(H78,試験規格マスタ!A:H,2,FALSE)","v":"K00014-1"},{"$f":"VLOOKUP(B78,試験規格マスタ!H:H,1,FALSE)","v":"K00014-1"}]
[75,"K00015",2,0,0,null,0,"エミッション_K00015",null,null,{"$f":"VLOOKUP(H79,試験規格マスタ!A:H,2,FALSE)","v":"K00015"},{"$f":"VLOOKUP(B79,試験規格マスタ!H:H,1,FALSE)","v":"K00015"}]
[76,"KN15",2,0,0,null,0,"エミッション_KN15",null,null,{"$f":"VLOOKUP(H80,試験規格マスタ!A:H,2,FALSE)","v":"KN15"},{"$f":"VLOOKUP(B80,試験規格マスタ!H:H,1,FALSE)","v":"KN15"}]
[77,"K00022",2,0,0,null,0,"エミッション_K00022",null,null,{"$f":"VLOOKUP(H81,試験規格マスタ!A:H,2,FALSE)","v":"K00022"},{"$f":"VLOOKUP(B81,試験規格マスタ!H:H,1,FALSE)","v":"K00022"}]
[78,"KN22  ",2,0,0,null,0,"エミッション_KN22",null,null,{"$f":"VLOOKUP(H82,試験規格マスタ!A:H,2,FALSE)","v":"KN22"},{"$f":"VLOOKUP(B82,試験規格マスタ!H:H,1,FALSE)","v":"KN22  "}]
[79,"GB13837",2,0,0,null,0,"エミッション_GB13837",null,null,{"$f":"VLOOKUP(H83,試験規格マスタ!A:H,2,FALSE)","v":"GB13837"},{"$f":"VLOOKUP(B83,試験規格マスタ!H:H,1,FALSE)","v":"GB13837"}]
[80,"GB4343.1",2,0,0,null,0,"エミッション_GB4343_1",null,null,{"$f":"VLOOKUP(H84,試験規格マスタ!A:H,2,FALSE)","v":"GB4343.1"},{"$f":"VLOOKUP(B84,試験規格マスタ!H:H,1,FALSE)","v":"GB4343.1"}]
[81,"GB9254",2,0,0,null,0,"エミッション_GB9254",null,null,{"$f":"VLOOKUP(H85,試験規格マスタ!A:H,2,FALSE)","v":"GB9254"},{"$f":"VLOOKUP(B85,試験規格マスタ!H:H,1,FALSE)","v":"GB9254"}]
[82,"GB 17743",2,0,0,null,0,"エミッション_GB17743",null,null,{"$f":"VLOOKUP(H86,試験規格マスタ!A:H,2,FALSE)","v":"GB17743"},{"$f":"VLOOKUP(B86,試験規格マスタ!H:H,1,FALSE)","v":"GB 17743"}]
[83,"GOST R51318.13",2,0,0,null,0,"エミッション_GOST_R51318_13",null,null,{"$f":"VLOOKUP(H87,試験規格マスタ!A:H,2,FALSE)","v":"GOST.R51318.13"},{"$f":"VLOOKUP(B87,試験規格マスタ!H:H,1,FALSE)","v":"GOST R51318.13"}]
[84,"GOST R51318.14.1",2,0,0,null,0,"エミッション_GOST_R51318_14_1",null,null,{"$f":"VLOOKUP(H88,試験規格マスタ!A:H,2,FALSE)","v":"GOST.R51318.14.1"},{"$f":"VLOOKUP(B88,試験規格マスタ!H:H,1,FALSE)","v":"GOST R51318.14.1"}]
[85,"GOST R51318.15",2,0,0,null,0,"エミッション_GOST_R51318_15",null,null,{"$f":"VLOOKUP(H89,試験規格マスタ!A:H,2,FALSE)","v":"GOST.R51318.15"},{"$f":"VLOOKUP(B89,試験規格マスタ!H:H,1,FALSE)","v":"GOST R51318.15"}]
[86,"GOST R51318.22",2,0,0,null,0,"エミッション_GOST_R51318_22",null,null,{"$f":"VLOOKUP(H90,試験規格マスタ!A:H,2,FALSE)","v":"GOST.R51318.22"},{"$f":"VLOOKUP(B90,試験規格マスタ!H:H,1,FALSE)","v":"GOST R51318.22"}]
[87,"IEC61000-6-3",2,0,0,null,0,"エミッション_IEC61000-6-3",null,null,{"$f":"VLOOKUP(H91,試験規格マスタ!A:H,2,FALSE)","v":"IEC61000-6-3"},{"$f":"VLOOKUP(B91,試験規格マスタ!H:H,1,FALSE)","v":"IEC61000-6-3"}]
[88,"IEC61000-6-4",2,0,0,null,0,"エミッション_IEC61000-6-4",null,null,{"$f":"VLOOKUP(H92,試験規格マスタ!A:H,2,FALSE)","v":"IEC61000-6-4"},{"$f":"VLOOKUP(B92,試験規格マスタ!H:H,1,FALSE)","v":"IEC61000-6-4"}]
[89,"EN61000-6-3",2,0,0,null,0,"エミッション_EN61000-6-3",null,null,{"$f":"VLOOKUP(H93,試験規格マスタ!A:H,2,FALSE)","v":"EN61000-6-3"},{"$f":"VLOOKUP(B93,試験規格マスタ!H:H,1,FALSE)","v":"EN61000-6-3"}]
[90,"EN61000-6-4",2,0,0,null,0,"エミッション_EN61000-6-4",null,null,{"$f":"VLOOKUP(H94,試験規格マスタ!A:H,2,FALSE)","v":"EN61000-6-4"},{"$f":"VLOOKUP(B94,試験規格マスタ!H:H,1,FALSE)","v":"EN61000-6-4"}]
[91,"EN12015",2,0,0,null,0,"エミッション_EN12015",null,null,{"$f":"VLOOKUP(H95,試験規格マスタ!A:H,2,FALSE)","v":"EN12015"},{"$f":"VLOOKUP(B95,試験規格マスタ!H:H,1,FALSE)","v":"EN12015"}]
[92,"IEC 60533",2,0,0,null,0,"エミッション_IEC60533",null,null,{"$f":"VLOOKUP(H96,試験規格マスタ!A:H,2,FALSE)","v":"IEC60533"},{"$f":"VLOOKUP(B96,試験規格マスタ!H:H,1,FALSE)","v":"IEC 60533"}]
[93,"EN 60533",2,0,0,null,0,"エミッション_EN60533",null,null,{"$f":"VLOOKUP(H97,試験規格マスタ!A:H,2,FALSE)","v":"EN60533"},{"$f":"VLOOKUP(B97,試験規格マスタ!H:H,1,FALSE)","v":"EN 60533"}]
[94,"IEC 60945",2,0,0,null,0,"エミッション_IEC60945",null,null,{"$f":"VLOOKUP(H98,試験規格マスタ!A:H,2,FALSE)","v":"IEC60945"},{"$f":"VLOOKUP(B98,試験規格マスタ!H:H,1,FALSE)","v":"IEC 60945"}]
[95,"EN 60945",2,0,0,null,0,"エミッション_EN60945",null,null,{"$f":"VLOOKUP(H99,試験規格マスタ!A:H,2,FALSE)","v":"EN60945"},{"$f":"VLOOKUP(B99,試験規格マスタ!H:H,1,FALSE)","v":"EN 60945"}]
[96,"EN13309",2,0,0,null,0,"エミッション_EN13309",null,null,{"$f":"VLOOKUP(H100,試験規格マスタ!A:H,2,FALSE)","v":"EN13309"},{"$f":"VLOOKUP(B100,試験規格マスタ!H:H,1,FALSE)","v":"EN13309"}]
[97,"IEC62236-3-2",2,0,0,null,0,"エミッション_IEC62236-3-2",null,null,{"$f":"VLOOKUP(H101,試験規格マスタ!A:H,2,FALSE)","v":"IEC62236-3-2"},{"$f":"VLOOKUP(B101,試験規格マスタ!H:H,1,FALSE)","v":"IEC62236-3-2"}]
[98,"EN50121-3-2",2,0,0,null,0,"エミッション_EN50121-3-2",null,null,{"$f":"VLOOKUP(H102,試験規格マスタ!A:H,2,FALSE)","v":"EN50121-3-2"},{"$f":"VLOOKUP(B102,試験規格マスタ!H:H,1,FALSE)","v":"EN50121-3-2"}]
[99,"IEC62236-4",2,0,0,null,0,"エミッション_IEC62236-4",null,null,{"$f":"VLOOKUP(H103,試験規格マスタ!A:H,2,FALSE)","v":"IEC62236-4"},{"$f":"VLOOKUP(B103,試験規格マスタ!H:H,1,FALSE)","v":"IEC62236-4"}]
[100,"EN50121-4",2,0,0,null,0,"エミッション_EN50121-4",null,null,{"$f":"VLOOKUP(H104,試験規格マスタ!A:H,2,FALSE)","v":"EN50121-4"},{"$f":"VLOOKUP(B104,試験規格マスタ!H:H,1,FALSE)","v":"EN50121-4"}]
[101,"日本海事協会規格(船用材料機器)第７編１章（自動化機器および装置）",2,0,0,null,0,"エミッション_日本海事協会規格第7編1章",null,null,{"$f":"VLOOKUP(H105,試験規格マスタ!A:H,2,FALSE)","v":"日本海事協会規格（船用材料機器）第7編1章"},{"$f":"VLOOKUP(B105,試験規格マスタ!H:H,1,FALSE)","v":"日本海事協会規格(船用材料機器)第７編１章（自動化機器および装置）"}]
[102,"ICAS E10",2,0,0,null,0,"エミッション_ICAS_E10",null,null,{"$f":"VLOOKUP(H106,試験規格マスタ!A:H,2,FALSE)","v":"ICAS E10"},{"$f":"VLOOKUP(B106,試験規格マスタ!H:H,1,FALSE)","v":"ICAS E10"}]
[103,"IEC61326-1(製品個別要求条件IEC61326-2シリーズ)*",2,0,0,null,0,"エミッション_IEC61326-1",null,null,{"$f":"VLOOKUP(H107,試験規格マスタ!A:H,2,FALSE)","v":"IEC61326-1"},{"$f":"VLOOKUP(B107,試験規格マスタ!H:H,1,FALSE)","v":"IEC61326-1(製品個別要求条件IEC61326-2シリーズ)*"}]
[104,"EN61326-1(製品個別要求条件IEC61326-2シリーズ)*",2,0,0,null,0,"エミッション_EN61326-1",null,null,{"$f":"VLOOKUP(H108,試験規格マスタ!A:H,2,FALSE)","v":"EN61326-1"},{"$f":"VLOOKUP(B108,試験規格マスタ!H:H,1,FALSE)","v":"EN61326-1(製品個別要求条件IEC61326-2シリーズ)*"}]
[105,"IEC60601-1-2(製品個別要求条件IEC60601-2シリーズ)*",2,0,0,null,0,"エミッション_IEC60601-1-2",null,null,{"$f":"VLOOKUP(H109,試験規格マスタ!A:H,2,FALSE)","v":"IEC60601-1-2"},{"$f":"VLOOKUP(B109,試験規格マスタ!H:H,1,FALSE)","v":"IEC60601-1-2(製品個別要求条件IEC60601-2シリーズ)*"}]
[106,"EN60601-1-2(製品個別要求条件EN60601-2シリーズ)*",2,0,0,null,0,"エミッション_EN60601-1-2",null,null,{"$f":"VLOOKUP(H110,試験規格マスタ!A:H,2,FALSE)","v":"EN60601-1-2"},{"$f":"VLOOKUP(B110,試験規格マスタ!H:H,1,FALSE)","v":"EN60601-1-2(製品個別要求条件EN60601-2シリーズ)*"}]
[107,"JIS C1806-1",2,0,0,null,0,"エミッション_JIS_C1806-1",null,null,{"$f":"VLOOKUP(H111,試験規格マスタ!A:H,2,FALSE)","v":"JIS C1806-1"},{"$f":"VLOOKUP(B111,試験規格マスタ!H:H,1,FALSE)","v":"JIS C1806-1"}]
[108,"JIS T0601-1-2(製品個別要求条件JIS T0601-2シリーズ)*",2,0,0,null,0,"エミッション_JIS_T0601-1-2",null,null,{"$f":"VLOOKUP(H112,試験規格マスタ!A:H,2,FALSE)","v":"JIS T0601-1-2"},{"$f":"VLOOKUP(B112,試験規格マスタ!H:H,1,FALSE)","v":"JIS T0601-1-2(製品個別要求条件JIS T0601-2シリーズ)*"}]
[109,"* 特定の製品規格に限定する場合はご相談ください。",2,0,1,null,0]
[110,"記載のない試験規格をご希望の場合はここにご記入ください",2,0,2,null,0]
[111,"15．試験規格－電磁両立性イミュニティ",1,0,0,null,1,"イミュニティ",null,null,{"$f":"VLOOKUP(H115,試験規格マスタ!A:H,2,FALSE)","v":"イミュニティ試験"},{"$f":"VLOOKUP(B115,試験規格マスタ!H:H,1,FALSE)","v":"15．試験規格－電磁両立性イミュニティ"}]
[112,"CISPR14-2",2,0,0,null,0,"イミュニティ_CISPR14-2",null,null,{"$f":"VLOOKUP(H116,試験規格マスタ!A:H,2,FALSE)","v":"CISPR14-2"},{"$f":"VLOOKUP(B116,試験規格マスタ!H:H,1,FALSE)","v":"CISPR14-2"}]
[113,"CISPR20",2,1,0,null,0,"イミュニティ_CISPR20",null,null,{"$f":"VLOOKUP(H117,試験規格マスタ!A:H,2,FALSE)","v":"CISPR20"},{"$f":"VLOOKUP(B117,試験規格マスタ!H:H,1,FALSE)","v":"CISPR20"}]
[114,"CISPR24",2,0,0,null,0,"イミュニティ_CISPR24",null,null,{"$f":"VLOOKUP(H118,試験規格マスタ!A:H,2,FALSE)","v":"CISPR24"},{"$f":"VLOOKUP(B118,試験規格マスタ!H:H,1,FALSE)","v":"CISPR24"}]
[115,"EN55014-2",2,0,0,null,0,"イミュニティ_EN55014-2",null,null,{"$f":"VLOOKUP(H119,試験規格マスタ!A:H,2,FALSE)","v":"EN55014-2"},{"$f":"VLOOKUP(B119,試験規格マスタ!H:H,1,FALSE)","v":"EN55014-2"}]
[116,"EN55020",2,1,0,null,0,"イミュニティ_EN55020",null,null,{"$f":"VLOOKUP(H120,試験規格マスタ!A:H,2,FALSE)","v":"EN55020"},{"$f":"VLOOKUP(B120,試験規格マスタ!H:H,1,FALSE)","v":"EN55020"}]
[117,"EN55024",2,0,0,null,0,"イミュニティ_EN55024",null,null,{"$f":"VLOOKUP(H121,試験規格マスタ!A:H,2,FALSE)","v":"EN55024"},{"$f":"VLOOKUP(B121,試験規格マスタ!H:H,1,FALSE)","v":"EN55024"}]
[118,"IEC61000-6-1",2,0,0,null,0,"イミュニティ_IEC61000-6-1",null,null,{"$f":"VLOOKUP(H122,試験規格マスタ!A:H,2,FALSE)","v":"IEC61000-6-1"},{"$f":"VLOOKUP(B122,試験規格マスタ!H:H,1,FALSE)","v":"IEC61000-6-1"}]
[119,"IEC61000-6-2",2,0,0,null,0,"イミュニティ_IEC61000-6-2",null,null,{"$f":"VLOOKUP(H123,試験規格マスタ!A:H,2,FALSE)","v":"IEC61000-6-2"},{"$f":"VLOOKUP(B123,試験規格マスタ!H:H,1,FALSE)","v":"IEC61000-6-2"}]
[120,"EN61000-6-1",2,0,0,null,0,"イミュニティ_EN61000-6-1",null,null,{"$f":"VLOOKUP(H124,試験規格マスタ!A:H,2,FALSE)","v":"EN61000-6-1"},{"$f":"VLOOKUP(B124,試験規格マスタ!H:H,1,FALSE)","v":"EN61000-6-1"}]
[121,"EN61000-6-2",2,0,0,null,0,"イミュニティ_EN61000-6-2",null,null,{"$f":"VLOOKUP(H125,試験規格マスタ!A:H,2,FALSE)","v":"EN61000-6-2"},{"$f":"VLOOKUP(B125,試験規格マスタ!H:H,1,FALSE)","v":"EN61000-6-2"}]
[122,"AS/NZS CISPR14.2",2,0,0,null,0,"イミュニティ_AS_NZS_CISPR14-2",null,null,{"$f":"VLOOKUP(H126,試験規格マスタ!A:H,2,FALSE)","v":"AS/NZS_CISPR14-2"},{"$f":"VLOOKUP(B126,試験規格マスタ!H:H,1,FALSE)","v":"AS/NZS CISPR14.2"}]
[123,"AS/NZS CISPR20",2,1,0,null,0,"イミュニティ_AS_NZS_CISPR20",null,null,{"$f":"VLOOKUP(H127,試験規格マスタ!A:H,2,FALSE)","v":"AS/NZS_CISPR20"},{"$f":"VLOOKUP(B127,試験規格マスタ!H:H,1,FALSE)","v":"AS/NZS CISPR20"}]
[124,"AS/NZS CISPR24",2,0,0,null,0,"イミュニティ_AS_NZS_CISPR24",null,null,{"$f":"VLOOKUP(H128,試験規格マスタ!A:H,2,FALSE)","v":"AS/NZS_CISPR24"},{"$f":"VLOOKUP(B128,試験規格マスタ!H:H,1,FALSE)","v":"AS/NZS CISPR24"}]
[125,"AS/NZS 3200.1.2",2,0,0,null,0,"イミュニティ_AS_NZS_3200-1-2",null,null,{"$f":"VLOOKUP(H129,試験規格マスタ!A:H,2,FALSE)","v":"AS/NZS_3200-1-2"},{"$f":"VLOOKUP(B129,試験規格マスタ!H:H,1,FALSE)","v":"AS/NZS 3200.1.2"}]
[126,"AS/NZS 61000.6.1",2,0,0,null,0,"イミュニティ_AS_NZS_61000-6-1",null,null,{"$f":"VLOOKUP(H130,試験規格マスタ!A:H,2,FALSE)","v":"AS/NZS_61000-6-1"},{"$f":"VLOOKUP(B130,試験規格マスタ!H:H,1,FALSE)","v":"AS/NZS 61000.6.1"}]
[127,"AS/NZS 61000.6.2",2,0,0,null,0,"イミュニティ_AS_NZS_61000-6-2",null,null,{"$f":"VLOOKUP(H131,試験規格マスタ!A:H,2,FALSE)","v":"AS/NZS_61000-6-2"},{"$f":"VLOOKUP(B131,試験規格マスタ!H:H,1,FALSE)","v":"AS/NZS 61000.6.2"}]
[128,"JIS C61000-6-1",2,0,0,null,0,"イミュニティ_JIS_C61000-6-1",null,null,{"$f":"VLOOKUP(H132,試験規格マスタ!A:H,2,FALSE)","v":"JIS C61000-6-1"},{"$f":"VLOOKUP(B132,試験規格マスタ!H:H,1,FALSE)","v":"JIS C61000-6-1"}]
[129,"JIS C61000-6-2",2,0,0,null,0,"イミュニティ_JIS_C61000-6-2",null,null,{"$f":"VLOOKUP(H133,試験規格マスタ!A:H,2,FALSE)","v":"JIS C61000-6-2"},{"$f":"VLOOKUP(B133,試験規格マスタ!H:H,1,FALSE)","v":"JIS C61000-6-2"}]
[130,"J1000",2,0,0,null,0,"イミュニティ_J1000",null,null,{"$f":"VLOOKUP(H134,試験規格マスタ!A:H,2,FALSE)","v":"J1000"},{"$f":"VLOOKUP(B134,試験規格マスタ!H:H,1,FALSE)","v":"J1000"}]
[131,"EN55103-2",2,0,0,null,0,"イミュニティ_EN55103-2",null,null,{"$f":"VLOOKUP(H135,試験規格マスタ!A:H,2,FALSE)","v":"EN55103-2"},{"$f":"VLOOKUP(B135,試験規格マスタ!H:H,1,FALSE)","v":"EN55103-2"}]
[132,"EN12016",2,0,0,null,0,"イミュニティ_EN12016",null,null,{"$f":"VLOOKUP(H136,試験規格マスタ!A:H,2,FALSE)","v":"EN12016"},{"$f":"VLOOKUP(B136,試験規格マスタ!H:H,1,FALSE)","v":"EN12016"}]
[133,"K00014-1",2,0,0,null,0,"イミュニティ_K00014-1",null,null,{"$f":"VLOOKUP(H137,試験規格マスタ!A:H,2,FALSE)","v":"K00014-1"},{"$f":"VLOOKUP(B137,試験規格マスタ!H:H,1,FALSE)","v":"K00014-1"}]
[134,"K00020",2,1,0,null,0,"イミュニティ_K00020",null,null,{"$f":"VLOOKUP(H138,試験規格マスタ!A:H,2,FALSE)","v":"K00020"},{"$f":"VLOOKUP(B138,試験規格マスタ!H:H,1,FALSE)","v":"K00020"}]
[135,"K00024",2,0,0,null,0,"イミュニティ_K00024",null,null,{"$f":"VLOOKUP(H139,試験規格マスタ!A:H,2,FALSE)","v":"K00024"},{"$f":"VLOOKUP(B139,試験規格マスタ!H:H,1,FALSE)","v":"K00024"}]
[136,"KN24",2,0,0,null,0,"イミュニティ_KN24",null,null,{"$f":"VLOOKUP(H140,試験規格マスタ!A:H,2,FALSE)","v":"KN24"},{"$f":"VLOOKUP(B140,試験規格マスタ!H:H,1,FALSE)","v":"KN24"}]
[137,"GB4343.2",2,0,0,null,0,"イミュニティ_GB4343_2",null,null,{"$f":"VLOOKUP(H141,試験規格マスタ!A:H,2,FALSE)","v":"GB4343.2"},{"$f":"VLOOKUP(B141,試験規格マスタ!H:H,1,FALSE)","v":"GB4343.2"}]
[138,"GOST R51318.14.2",2,0,0,null,0,"イミュニティ_GOST_R51318_14_2",null,null,{"$f":"VLOOKUP(H142,試験規格マスタ!A:H,2,FALSE)","v":"GOST R51318.14.2"},{"$f":"VLOOKUP(B142,試験規格マスタ!H:H,1,FALSE)","v":"GOST R51318.14.2"}]
[139,"GOST R51318.24",2,0,0,null,0,"イミュニティ_GOST_R51318_24",null,null,{"$f":"VLOOKUP(H143,試験規格マスタ!A:H,2,FALSE)","v":"GOST R51318.24"},{"$f":"VLOOKUP(B143,試験規格マスタ!H:H,1,FALSE)","v":"GOST R51318.24"}]
[140,"IEC61800-3",2,0,0,null,0,"イミュニティ_IEC61800-3",null,null,{"$f":"VLOOKUP(H144,試験規格マスタ!A:H,2,FALSE)","v":"IEC61800-3"},{"$f":"VLOOKUP(B144,試験規格マスタ!H:H,1,FALSE)","v":"IEC61800-3"}]
[141,"EN61800-3",2,0,0,null,0,"イミュニティ_EN61800-3",null,null,{"$f":"VLOOKUP(H145,試験規格マスタ!A:H,2,FALSE)","v":"EN61800-3"},{"$f":"VLOOKUP(B145,試験規格マスタ!H:H,1,FALSE)","v":"EN61800-3"}]
[142,"IEC 61326-3-1",2,0,0,null,0,"イミュニティ_IEC61326-3-1",null,null,{"$f":"VLOOKUP(H146,試験規格マスタ!A:H,2,FALSE)","v":"IEC61326-3-1"},{"$f":"VLOOKUP(B146,試験規格マスタ!H:H,1,FALSE)","v":"IEC 61326-3-1"}]
[143,"EN 61326-3-2",2,0,0,null,0,"イミュニティ_EN61326-3-2",null,null,{"$f":"VLOOKUP(H147,試験規格マスタ!A:H,2,FALSE)","v":"EN61326-3-2"},{"$f":"VLOOKUP(B147,試験規格マスタ!H:H,1,FALSE)","v":"EN 61326-3-2"}]
[144,"IEC 61547",2,0,0,null,0,"イミュニティ_IEC61547",null,null,{"$f":"VLOOKUP(H148,試験規格マスタ!A:H,2,FALSE)","v":"IEC61547"},{"$f":"VLOOKUP(B148,試験規格マスタ!H:H,1,FALSE)","v":"IEC 61547"}]
[145,"EN 61547",2,0,0,null,0,"イミュニティ_EN61547",null,null,{"$f":"VLOOKUP(H149,試験規格マスタ!A:H,2,FALSE)","v":"EN61547"},{"$f":"VLOOKUP(B149,試験規格マスタ!H:H,1,FALSE)","v":"EN 61547"}]
[146,"EN 50130-4",2,0,0,null,0,"イミュニティ_EN50130-4",null,null,{"$f":"VLOOKUP(H150,試験規格マスタ!A:H,2,FALSE)","v":"EN50130-4"},{"$f":"VLOOKUP(B150,試験規格マスタ!H:H,1,FALSE)","v":"EN 50130-4"}]
[147,"IEC 60533",2,0,0,null,0,"イミュニティ_IEC60533",null,null,{"$f":"VLOOKUP(H151,試験規格マスタ!A:H,2,FALSE)","v":"IEC60533"},{"$f":"VLOOKUP(B151,試験規格マスタ!H:H,1,FALSE)","v":"IEC 60533"}]
[148,"EN 60533",2,0,0,null,0,"イミュニティ_EN60533",null,null,{"$f":"VLOOKUP(H152,試験規格マスタ!A:H,2,FALSE)","v":"EN60533"},{"$f":"VLOOKUP(B152,試験規格マスタ!H:H,1,FALSE)","v":"EN 60533"}]
[149,"IEC 60945",2,0,0,null,0,"イミュニティ_IEC60945",null,null,{"$f":"VLOOKUP(H153,試験規格マスタ!A:H,2,FALSE)","v":"IEC60945"},{"$f":"VLOOKUP(B153,試験規格マスタ!H:H,1,FALSE)","v":"IEC 60945"}]
[150,"EN 60945",2,0,0,null,0,"イミュニティ_EN60945",null,null,{"$f":"VLOOKUP(H154,試験規格マスタ!A:H,2,FALSE)","v":"EN60945"},{"$f":"VLOOKUP(B154,試験規格マスタ!H:H,1,FALSE)","v":"EN 60945"}]
[151,"EN13309",2,0,0,null,0,"イミュニティ_EN13309",null,null,{"$f":"VLOOKUP(H155,試験規格マスタ!A:H,2,FALSE)","v":"EN13309"},{"$f":"VLOOKUP(B155,試験規格マスタ!H:H,1,FALSE)","v":"EN13309"}]
[152,"IEC 62236-3-2",2,0,0,null,0,"イミュニティ_IEC62236-3-2",null,null,{"$f":"VLOOKUP(H156,試験規格マスタ!A:H,2,FALSE)","v":"IEC62236-3-2"},{"$f":"VLOOKUP(B156,試験規格マスタ!H:H,1,FALSE)","v":"IEC 62236-3-2"}]
[153,"EN 50121-3-2",2,0,0,null,0,"イミュニティ_EN50121-3-2",null,null,{"$f":"VLOOKUP(H157,試験規格マスタ!A:H,2,FALSE)","v":"EN50121-3-2"},{"$f":"VLOOKUP(B157,試験規格マスタ!H:H,1,FALSE)","v":"EN 50121-3-2"}]
[154,"IEC 62236-4",2,0,0,null,0,"イミュニティ_IEC62236-4",null,null,{"$f":"VLOOKUP(H158,試験規格マスタ!A:H,2,FALSE)","v":"IEC62236-4"},{"$f":"VLOOKUP(B158,試験規格マスタ!H:H,1,FALSE)","v":"IEC 62236-4"}]
[155,"EN 50121-4",2,0,0,null,0,"イミュニティ_EN50121-4",null,null,{"$f":"VLOOKUP(H159,試験規格マスタ!A:H,2,FALSE)","v":"EN50121-4"},{"$f":"VLOOKUP(B159,試験規格マスタ!H:H,1,FALSE)","v":"EN 50121-4"}]
[156,"ISO 22200",2,0,0,null,0,"イミュニティ_ISO22200",null,null,{"$f":"VLOOKUP(H160,試験規格マスタ!A:H,2,FALSE)","v":"ISO22200"},{"$f":"VLOOKUP(B160,試験規格マスタ!H:H,1,FALSE)","v":"ISO 22200"}]
[157,"KN 61547",2,0,0,null,0,"イミュニティ_KN61547",null,null,{"$f":"VLOOKUP(H161,試験規格マスタ!A:H,2,FALSE)","v":"KN61547"},{"$f":"VLOOKUP(B161,試験規格マスタ!H:H,1,FALSE)","v":"KN 61547"}]
[158,"日本海事協会規格(船用材料機器)第７編１章（自動化機器および装置）",2,0,0,null,0,"イミュニティ_日本海事協会規格第7編1章",null,null,{"$f":"VLOOKUP(H162,試験規格マスタ!A:H,2,FALSE)","v":"日本海事協会規格（船用材料機器）第7編1章"},{"$f":"VLOOKUP(B162,試験規格マスタ!H:H,1,FALSE)","v":"日本海事協会規格(船用材料機器)第７編１章（自動化機器および装置）"}]
[159,"ICAS E10",2,0,0,null,0,"イミュニティ_ICAS_E10",null,null,{"$f":"VLOOKUP(H163,試験規格マスタ!A:H,2,FALSE)","v":"ICAS E10"},{"$f":"VLOOKUP(B163,試験規格マスタ!H:H,1,FALSE)","v":"ICAS E10"}]
[160,"IEC61326-1(製品個別要求条件IEC61326-2シリーズ)*",2,0,0,null,0,"イミュニティ_IEC61326-1",null,null,{"$f":"VLOOKUP(H164,試験規格マスタ!A:H,2,FALSE)","v":"IEC61326-1"},{"$f":"VLOOKUP(B164,試験規格マスタ!H:H,1,FALSE)","v":"IEC61326-1(製品個別要求条件IEC61326-2シリーズ)*"}]
[161,"EN61326-1(製品個別要求条件IEC61326-2シリーズ)*",2,0,0,null,0,"イミュニティ_EN61326-1",null,null,{"$f":"VLOOKUP(H165,試験規格マスタ!A:H,2,FALSE)","v":"EN61326-1"},{"$f":"VLOOKUP(B165,試験規格マスタ!H:H,1,FALSE)","v":"EN61326-1(製品個別要求条件IEC61326-2シリーズ)*"}]
[162,"IEC60601-1-2(製品個別要求条件IEC60601-2シリーズ)*",2,0,0,null,0,"イミュニティ_IEC60601-1-2",null,null,{"$f":"VLOOKUP(H166,試験規格マスタ!A:H,2,FALSE)","v":"IEC60601-1-2"},{"$f":"VLOOKUP(B166,試験規格マスタ!H:H,1,FALSE)","v":"IEC60601-1-2(製品個別要求条件IEC60601-2シリーズ)*"}]
[163,"EN60601-1-2(製品個別要求条件EN60601-2シリーズ)*",2,0,0,null,0,"イミュニティ_EN60601-1-2",null,null,{"$f":"VLOOKUP(H167,試験規格マスタ!A:H,2,FALSE)","v":"EN60601-1-2"},{"$f":"VLOOKUP(B167,試験規格マスタ!H:H,1,FALSE)","v":"EN60601-1-2(製品個別要求条件EN60601-2シリーズ)*"}]
[164,"JIS C1806-1",2,0,0,null,0,"イミュニティ_JIS_C1806-1",null,null,{"$f":"VLOOKUP(H168,試験規格マスタ!A:H,2,FALSE)","v":"JIS C1806-1"},{"$f":"VLOOKUP(B168,試験規格マスタ!H:H,1,FALSE)","v":"JIS C1806-1"}]
[165,"JIS T0601-1-2(製品個別要求条件JIS T0601-2シリーズ)*",2,0,0,null,0,"イミュニティ_JIS_T0601-1-2",null,null,{"$f":"VLOOKUP(H169,試験規格マスタ!A:H,2,FALSE)","v":"JIS T0601-1-2"},{"$f":"VLOOKUP(B169,試験規格マスタ!H:H,1,FALSE)","v":"JIS T0601-1-2(製品個別要求条件JIS T0601-2シリーズ)*"}]
[166,"* 特定の製品規格に限定する場合はご相談ください。",2,0,1,null,0]
[167,"記載のない試験規格をご希望の場合はここにご記入ください",2,0,2,null,0]
[168,"16．試験規格－電源高調波",1,0,0,null,1,"電源高調波",null,null,{"$f":"VLOOKUP(H172,試験規格マスタ!A:H,2,FALSE)","v":"電源高調波試験"},{"$f":"VLOOKUP(B172,試験規格マスタ!H:H,1,FALSE)","v":"16．試験規格－電源高調波"}]
[169,"IEC61000-3-2",2,0,0,null,0,"電源高調波_IEC61000-3-2",null,null,{"$f":"VLOOKUP(H173,試験規格マスタ!A:H,2,FALSE)","v":"IEC61000-3-2"},{"$f":"VLOOKUP(B173,試験規格マスタ!H:H,1,FALSE)","v":"IEC61000-3-2"}]
[170,"IEC61000-3-12",2,0,0,null,0,"電源高調波_IEC61000-3-12",null,null,{"$f":"VLOOKUP(H174,試験規格マスタ!A:H,2,FALSE)","v":"IEC61000-3-12"},{"$f":"VLOOKUP(B174,試験規格マスタ!H:H,1,FALSE)","v":"IEC61000-3-12"}]
[171,"IEC61000-3-3",2,0,0,null,0,"電源高調波_IEC61000-3-3",null,null,{"$f":"VLOOKUP(H175,試験規格マスタ!A:H,2,FALSE)","v":"IEC61000-3-3"},{"$f":"VLOOKUP(B175,試験規格マスタ!H:H,1,FALSE)","v":"IEC61000-3-3"}]
[172,"IEC61000-3-11",2,0,0,null,0,"電源高調波_IEC61000-3-11",null,null,{"$f":"VLOOKUP(H176,試験規格マスタ!A:H,2,FALSE)","v":"IEC61000-3-11"},{"$f":"VLOOKUP(B176,試験規格マスタ!H:H,1,FALSE)","v":"IEC61000-3-11"}]
[173,"JIS C61000-3-2",2,0,0,null,0,"電源高調波_JIS_C61000-3-2",null,null,{"$f":"VLOOKUP(H177,試験規格マスタ!A:H,2,FALSE)","v":"JIS C61000-3-2"},{"$f":"VLOOKUP(B177,試験規格マスタ!H:H,1,FALSE)","v":"JIS C61000-3-2"}]
[174,"IEC61000-6-3",2,0,0,null,0,"電源高調波_IEC61000-6-3",null,null,{"$f":"VLOOKUP(H178,試験規格マスタ!A:H,2,FALSE)","v":"IEC61000-6-3"},{"$f":"VLOOKUP(B178,試験規格マスタ!H:H,1,FALSE)","v":"IEC61000-6-3"}]
[175,"IEC61000-6-4",2,0,0,null,0,"電源高調波_IEC61000-6-4",null,null,{"$f":"VLOOKUP(H179,試験規格マスタ!A:H,2,FALSE)","v":"IEC61000-6-4"},{"$f":"VLOOKUP(B179,試験規格マスタ!H:H,1,FALSE)","v":"IEC61000-6-4"}]
[176,"EN61000-6-3",2,0,0,null,0,"電源高調波_EN61000-6-3",null,null,{"$f":"VLOOKUP(H180,試験規格マスタ!A:H,2,FALSE)","v":"EN61000-6-3"},{"$f":"VLOOKUP(B180,試験規格マスタ!H:H,1,FALSE)","v":"EN61000-6-3"}]
[177,"EN61000-6-4",2,0,0,null,0,"電源高調波_EN61000-6-4",null,null,{"$f":"VLOOKUP(H181,試験規格マスタ!A:H,2,FALSE)","v":"EN61000-6-4"},{"$f":"VLOOKUP(B181,試験規格マスタ!H:H,1,FALSE)","v":"EN61000-6-4"}]
[178,"EN61000-3-2",2,0,0,null,0,"電源高調波_EN61000-3-2",null,null,{"$f":"VLOOKUP(H182,試験規格マスタ!A:H,2,FALSE)","v":"EN61000-3-2"},{"$f":"VLOOKUP(B182,試験規格マスタ!H:H,1,FALSE)","v":"EN61000-3-2"}]
[179,"EN61000-3-12",2,0,0,null,0,"電源高調波_EN61000-3-12",null,null,{"$f":"VLOOKUP(H183,試験規格マスタ!A:H,2,FALSE)","v":"EN61000-3-12"},{"$f":"VLOOKUP(B183,試験規格マスタ!H:H,1,FALSE)","v":"EN61000-3-12"}]
[180,"EN61000-3-3",2,0,0,null,0,"電源高調波_EN61000-3-3",null,null,{"$f":"VLOOKUP(H184,試験規格マスタ!A:H,2,FALSE)","v":"EN61000-3-3"},{"$f":"VLOOKUP(B184,試験規格マスタ!H:H,1,FALSE)","v":"EN61000-3-3"}]
[181,"EN61000-3-11",2,0,0,null,0,"電源高調波_EN61000-3-11",null,null,{"$f":"VLOOKUP(H185,試験規格マスタ!A:H,2,FALSE)","v":"EN61000-3-11"},{"$f":"VLOOKUP(B185,試験規格マスタ!H:H,1,FALSE)","v":"EN61000-3-11"}]
[182,"AS/NZS 3200.1.2",2,0,0,null,0,"電源高調波_AS_NZS_3200-1-2",null,null,{"$f":"VLOOKUP(H186,試験規格マスタ!A:H,2,FALSE)","v":"AS/NZS_3200-1-2"},{"$f":"VLOOKUP(B186,試験規格マスタ!H:H,1,FALSE)","v":"AS/NZS 3200.1.2"}]
[183,"AS/NZS 61000.3.2",2,0,0,null,0,"電源高調波_AS_NZS_61000-3-2",null,null,{"$f":"VLOOKUP(H187,試験規格マスタ!A:H,2,FALSE)","v":"AS/NZS_61000-3-2"},{"$f":"VLOOKUP(B187,試験規格マスタ!H:H,1,FALSE)","v":"AS/NZS 61000.3.2"}]
[184,"AS/NZS 61000.3.12",2,0,0,null,0,"電源高調波_AS_NZS_61000-3-12",null,null,{"$f":"VLOOKUP(H188,試験規格マスタ!A:H,2,FALSE)","v":"AS/NZS_61000-3-4"},{"$f":"VLOOKUP(B188,試験規格マスタ!H:H,1,FALSE)","v":"AS/NZS 61000.3.12"}]
[185,"AS/NZS 61000.3.3",2,0,0,null,0,"電源高調波_AS_NZS_61000-3-3",null,null,{"$f":"VLOOKUP(H189,試験規格マスタ!A:H,2,FALSE)","v":"AS/NZS_61000-3-3"},{"$f":"VLOOKUP(B189,試験規格マスタ!H:H,1,FALSE)","v":"AS/NZS 61000.3.3"}]
[186,"AS/NZS 61000.3.11",2,0,0,null,0,"電源高調波_AS_NZS_61000-3-11",null,null,{"$f":"VLOOKUP(H190,試験規格マスタ!A:H,2,FALSE)","v":"AS/NZS_61000-3-11"},{"$f":"VLOOKUP(B190,試験規格マスタ!H:H,1,FALSE)","v":"AS/NZS 61000.3.11"}]
[187,"AS/NZS 61000.6.3",2,0,0,null,0,"電源高調波_AS_NZS_61000-6-3",null,null,{"$f":"VLOOKUP(H191,試験規格マスタ!A:H,2,FALSE)","v":"AS/NZS_61000-6-3"},{"$f":"VLOOKUP(B191,試験規格マスタ!H:H,1,FALSE)","v":"AS/NZS 61000.6.3"}]
[188,"AS/NZS 61000.6.4",2,0,0,null,0,"電源高調波_AS_NZS_61000-6-4",null,null,{"$f":"VLOOKUP(H192,試験規格マスタ!A:H,2,FALSE)","v":"AS/NZS_61000-6-4"},{"$f":"VLOOKUP(B192,試験規格マスタ!H:H,1,FALSE)","v":"AS/NZS 61000.6.4"}]
[189,"GB17625.1",2,0,0,null,0,"電源高調波_GB17625_1",null,null,{"$f":"VLOOKUP(H193,試験規格マスタ!A:H,2,FALSE)","v":"GB17625.1"},{"$f":"VLOOKUP(B193,試験規格マスタ!H:H,1,FALSE)","v":"GB17625.1"}]
[190,"GOST R51317.3.2",2,0,0,null,0,"電源高調波_GOST_R51317_3_2",null,null,{"$f":"VLOOKUP(H194,試験規格マスタ!A:H,2,FALSE)","v":"GOST R51317.3.2"},{"$f":"VLOOKUP(B194,試験規格マスタ!H:H,1,FALSE)","v":"GOST R51317.3.2"}]
[191,"GOST R51317.3.3",2,0,0,null,0,"電源高調波_GOST_R51317_3_3",null,null,{"$f":"VLOOKUP(H195,試験規格マスタ!A:H,2,FALSE)","v":"GOST R51317.3.3"},{"$f":"VLOOKUP(B195,試験規格マスタ!H:H,1,FALSE)","v":"GOST R51317.3.3"}]
[192,"IEC61326-1(製品個別要求条件IEC61326-2シリーズ)*",2,0,0,null,0,"電源高調波_IEC61326-1",null,null,{"$f":"VLOOKUP(H196,試験規格マスタ!A:H,2,FALSE)","v":"IEC61326-1"},{"$f":"VLOOKUP(B196,試験規格マスタ!H:H,1,FALSE)","v":"IEC61326-1(製品個別要求条件IEC61326-2シリーズ)*"}]
[193,"EN61326-1(製品個別要求条件IEC61326-2シリーズ)*",2,0,0,null,0,"電源高調波_EN61326-1",null,null,{"$f":"VLOOKUP(H197,試験規格マスタ!A:H,2,FALSE)","v":"EN61326-1"},{"$f":"VLOOKUP(B197,試験規格マスタ!H:H,1,FALSE)","v":"EN61326-1(製品個別要求条件IEC61326-2シリーズ)*"}]
[194,"IEC60601-1-2(製品個別要求条件IEC60601-2シリーズ)*",2,0,0,null,0,"電源高調波_IEC60601-1-2",null,null,{"$f":"VLOOKUP(H198,試験規格マスタ!A:H,2,FALSE)","v":"IEC60601-1-2"},{"$f":"VLOOKUP(B198,試験規格マスタ!H:H,1,FALSE)","v":"IEC60601-1-2(製品個別要求条件IEC60601-2シリーズ)*"}]
[195,"EN60601-1-2(製品個別要求条件EN60601-2シリーズ)*",2,0,0,null,0,"電源高調波_EN60601-1-2",null,null,{"$f":"VLOOKUP(H199,試験規格マスタ!A:H,2,FALSE)","v":"EN60601-1-2"},{"$f":"VLOOKUP(B199,試験規格マスタ!H:H,1,FALSE)","v":"EN60601-1-2(製品個別要求条件EN60601-2シリーズ)*"}]
[196,"JIS C1806-1",2,0,0,null,0,"電源高調波_JIS_C1806-1",null,null,{"$f":"VLOOKUP(H200,試験規格マスタ!A:H,2,FALSE)","v":"JIS C1806-1"},{"$f":"VLOOKUP(B200,試験規格マスタ!H:H,1,FALSE)","v":"JIS C1806-1"}]
[197,"JIS T0601-1-2(製品個別要求条件JIS T0601-2シリーズ)*",2,0,0,null,0,"電源高調波_JIS_T0601-1-2",null,null,{"$f":"VLOOKUP(H201,試験規格マスタ!A:H,2,FALSE)","v":"JIS T0601-1-2"},{"$f":"VLOOKUP(B201,試験規格マスタ!H:H,1,FALSE)","v":"JIS T0601-1-2(製品個別要求条件JIS T0601-2シリーズ)*"}]
[198,"* 特定の製品規格に限定する場合はご相談ください。",2,0,1,null,0]
[199,"記載のない試験規格をご希望の場合はここにご記入ください",2,0,2,null,0]
[200,"17．試験規格－自動車・車載機器",1,0,0,null,1,"自動車車載機器",null,null,{"$f":"VLOOKUP(H204,試験規格マスタ!A:H,2,FALSE)","v":"自動車・車載機器"},{"$f":"VLOOKUP(B204,試験規格マスタ!H:H,1,FALSE)","v":"17．試験規格－自動車・車載機器"}]
[201,"EU Directive 72/245/EEC",2,0,0,null,0,"自動車車載機器_EU_Directive_72_245_EEC",null,null,{"$f":"VLOOKUP(H205,試験規格マスタ!A:H,2,FALSE)","v":"EU Directive 72/245/EEC"},{"$f":"VLOOKUP(B205,試験規格マスタ!H:H,1,FALSE)","v":"EU Directive 72/245/EEC"}]
[202,"EU Directive 2004/104/EC, Annex I, 6.5, 6.6, 6.8, 6.9章",2,0,0,null,0,"自動車車載機器_EU_Directive_2004_104_EC",null,null,{"$f":"VLOOKUP(H206,試験規格マスタ!A:H,2,FALSE)","v":"EU Directive 2004/104/EC, Annex I, 6.5, 6.6, 6.8, 6.9章"},{"$f":"VLOOKUP(B206,試験規格マスタ!H:H,1,FALSE)","v":"EU Directive 2004/104/EC, Annex I, 6.5, 6.6, 6.8, 6.9章"}]
[203,"ECE R-10, 6.5, 6.6, 6.8, 6.9章",2,0,0,null,0,"自動車車載機器_ECE_R-10",null,null,{"$f":"VLOOKUP(H207,試験規格マスタ!A:H,2,FALSE)","v":"ECE R-10, 6.5, 6.6, 6.8, 6.9章"},{"$f":"VLOOKUP(B207,試験規格マスタ!H:H,1,FALSE)","v":"ECE R-10, 6.5, 6.6, 6.8, 6.9章"}]
[204,"EN 50498",2,0,0,null,0,"自動車車載機器_EN50498",null,null,{"$f":"VLOOKUP(H208,試験規格マスタ!A:H,2,FALSE)","v":"EN 50498"},{"$f":"VLOOKUP(B208,試験規格マスタ!H:H,1,FALSE)","v":"EN 50498"}]
[205,"記載のない試験規格をご希望の場合はここにご記入ください",2,0,2,null,0]
[206,"18．試験規格－音響",1,0,0,null,1,"空気伝搬騒音",null,null,{"$f":"VLOOKUP(H210,試験規格マスタ!A:H,2,FALSE)","v":"空気伝搬騒音試験"},{"$f":"VLOOKUP(B210,試験規格マスタ!H:H,1,FALSE)","v":"18．試験規格－音響"}]
[207,"ISO 7779",2,0,0,null,0,"空気伝搬騒音_ISO7779",null,null,{"$f":"VLOOKUP(H211,試験規格マスタ!A:H,2,FALSE)","v":"ISO7779"},{"$f":"VLOOKUP(B211,試験規格マスタ!H:H,1,FALSE)","v":"ISO 7779"}]
[208,"JIS X7779",2,0,0,null,0,"空気伝搬騒音_JIS_X7779",null,null,{"$f":"VLOOKUP(H212,試験規格マスタ!A:H,2,FALSE)","v":"JIS X7779"},{"$f":"VLOOKUP(B212,試験規格マスタ!H:H,1,FALSE)","v":"JIS X7779"}]
[209,"EN ISO 7779",2,0,0,null,0,"空気伝搬騒音_EN_ISO7779",null,null,{"$f":"VLOOKUP(H213,試験規格マスタ!A:H,2,FALSE)","v":"EN_ISO7779"},{"$f":"VLOOKUP(B213,試験規格マスタ!H:H,1,FALSE)","v":"EN ISO 7779"}]
[210,"ECMA-74",2,0,0,null,0,"空気伝搬騒音_ECMA-74",null,null,{"$f":"VLOOKUP(H214,試験規格マスタ!A:H,2,FALSE)","v":"ECMA-74"},{"$f":"VLOOKUP(B214,試験規格マスタ!H:H,1,FALSE)","v":"ECMA-74"}]
[211,"German BlueAngel",2,0,0,null,0,"空気伝搬騒音_ブルーエンジェルマーク",null,null,{"$f":"VLOOKUP(H215,試験規格マスタ!A:H,2,FALSE)","v":"ブルーエンジェルマーク"},{"$f":"VLOOKUP(B215,試験規格マスタ!H:H,1,FALSE)","v":"German BlueAngel"}]
[212,"RAL-UZ 78",3,0,0,null,0,"空気伝搬騒音_ブルーエンジェルマーク_RAL-UZ78",null,null,{"$f":"VLOOKUP(H216,試験規格マスタ!A:H,2,FALSE)","v":"RAL-UZ78"},{"$f":"VLOOKUP(B216,試験規格マスタ!H:H,1,FALSE)","v":"RAL-UZ 78"}]
[213,"RAL-UZ 122",3,0,0,null,0,"空気伝搬騒音_ブルーエンジェルマーク_RAL-UZ122",null,null,{"$f":"VLOOKUP(H217,試験規格マスタ!A:H,2,FALSE)","v":"RAL-UZ122"},{"$f":"VLOOKUP(B217,試験規格マスタ!H:H,1,FALSE)","v":"RAL-UZ 122"}]
[214,"RAL-UZ 127",3,0,0,null,0,"空気伝搬騒音_ブルーエンジェルマーク_RAL-UZ127",null,null,{"$f":"VLOOKUP(H218,試験規格マスタ!A:H,2,FALSE)","v":"RAL-UZ127"},{"$f":"VLOOKUP(B218,試験規格マスタ!H:H,1,FALSE)","v":"RAL-UZ 127"}]
[215,"RAL-UZ 171",3,0,0,null,0,"空気伝搬騒音_ブルーエンジェルマーク_RAL-UZ171",null,null,{"$f":"VLOOKUP(H219,試験規格マスタ!A:H,2,FALSE)","v":"RAL-UZ171"},{"$f":"VLOOKUP(B219,試験規格マスタ!H:H,1,FALSE)","v":"RAL-UZ 171"}]
[216,"日本環境協会エコマーク商品類型",2,0,0,null,0,"空気伝搬騒音_日本環境協会エコマーク商品類型",null,null,{"$f":"VLOOKUP(H220,試験規格マスタ!A:H,2,FALSE)","v":"日本環境協会エコマーク商品類型"},{"$f":"VLOOKUP(B220,試験規格マスタ!H:H,1,FALSE)","v":"日本環境協会エコマーク商品類型"}]
[217,"No.117",3,0,0,null,0,"空気伝搬騒音_日本環境協会エコマーク商品類型_No117",null,null,{"$f":"VLOOKUP(H221,試験規格マスタ!A:H,2,FALSE)","v":"No.117"},{"$f":"VLOOKUP(B221,試験規格マスタ!H:H,1,FALSE)","v":"No.117"}]
[218,"No.119",3,0,0,null,0,"空気伝搬騒音_日本環境協会エコマーク商品類型_No119",null,null,{"$f":"VLOOKUP(H222,試験規格マスタ!A:H,2,FALSE)","v":"No.119"},{"$f":"VLOOKUP(B222,試験規格マスタ!H:H,1,FALSE)","v":"No.119"}]
[219,"No.122",3,0,0,null,0,"空気伝搬騒音_日本環境協会エコマーク商品類型_No122",null,null,{"$f":"VLOOKUP(H223,試験規格マスタ!A:H,2,FALSE)","v":"No.122"},{"$f":"VLOOKUP(B223,試験規格マスタ!H:H,1,FALSE)","v":"No.122"}]
[220,"No.155",3,0,0,null,0,"空気伝搬騒音_日本環境協会エコマーク商品類型_No155",null,null,{"$f":"VLOOKUP(H224,試験規格マスタ!A:H,2,FALSE)","v":"No.155"},{"$f":"VLOOKUP(B224,試験規格マスタ!H:H,1,FALSE)","v":"No.155"}]
[221,"記載のない試験規格をご希望の場合はここにご記入ください",2,0,2,null,0]
[222,"19．試験規格－通信機性能 １",1,0,0,null,1,"通信機器性能",null,null,{"$f":"VLOOKUP(H226,試験規格マスタ!A:H,2,FALSE)","v":"通信機器性能試験"},{"$f":"VLOOKUP(B226,試験規格マスタ!H:H,1,FALSE)","v":"19．試験規格－通信機性能 １"}]
[223,"FCC Part15 Sub.C",2,0,0,null,0,"通信機器性能_FCC_Part15_Sub_C",null,null,{"$f":"VLOOKUP(H227,試験規格マスタ!A:H,2,FALSE)","v":"FCC_Part15_Sub_C"},{"$f":"VLOOKUP(B227,試験規格マスタ!H:H,1,FALSE)","v":"FCC Part15 Sub.C"}]
[224,"FCC Part15 Sub.D ",2,0,0,null,0,"通信機器性能_FCC_Part15_Sub_D",null,null,{"$f":"VLOOKUP(H228,試験規格マスタ!A:H,2,FALSE)","v":"FCC_Part15_Sub_D"},{"$f":"VLOOKUP(B228,試験規格マスタ!H:H,1,FALSE)","v":"FCC Part15 Sub.D "}]
[225,"FCC Part15 Sub.E",2,0,0,null,0,"通信機器性能_FCC_Part15_Sub_E",null,null,{"$f":"VLOOKUP(H229,試験規格マスタ!A:H,2,FALSE)","v":"FCC_Part15_Sub_E"},{"$f":"VLOOKUP(B229,試験規格マスタ!H:H,1,FALSE)","v":"FCC Part15 Sub.E"}]
[226,"FCC Part22 Sub.E",2,0,0,null,0,"通信機器性能_FCC_Part22_Sub_E",null,null,{"$f":"VLOOKUP(H230,試験規格マスタ!A:H,2,FALSE)","v":"FCC_Part22_Sub_E"},{"$f":"VLOOKUP(B230,試験規格マスタ!H:H,1,FALSE)","v":"FCC Part22 Sub.E"}]
[227,"FCC Part22 Sub.H ",2,0,0,null,0,"通信機器性能_FCC_Part22_Sub_H",null,null,{"$f":"VLOOKUP(H231,試験規格マスタ!A:H,2,FALSE)","v":"FCC_Part22_Sub_H"},{"$f":"VLOOKUP(B231,試験規格マスタ!H:H,1,FALSE)","v":"FCC Part22 Sub.H "}]
[228,"FCC Part24 Sub.D ",2,0,0,null,0,"通信機器性能_FCC_Part24_Sub_D",null,null,{"$f":"VLOOKUP(H232,試験規格マスタ!A:H,2,FALSE)","v":"FCC_Part24_Sub_D"},{"$f":"VLOOKUP(B232,試験規格マスタ!H:H,1,FALSE)","v":"FCC Part24 Sub.D "}]
[229,"FCC Part24 Sub.E",2,0,0,null,0,"通信機器性能_FCC_Part24_Sub_E",null,null,{"$f":"VLOOKUP(H233,試験規格マスタ!A:H,2,FALSE)","v":"FCC_Part24_Sub_E"},{"$f":"VLOOKUP(B233,試験規格マスタ!H:H,1,FALSE)","v":"FCC Part24 Sub.E"}]
[230,"FCC Part25",2,0,0,null,0,"通信機器性能_FCC_Part25",null,null,{"$f":"VLOOKUP(H234,試験規格マスタ!A:H,2,FALSE)","v":"FCC_Part25"},{"$f":"VLOOKUP(B234,試験規格マスタ!H:H,1,FALSE)","v":"FCC Part25"}]
[231,"FCC Part27",2,0,0,null,0,"通信機器性能_FCC_Part27",null,null,{"$f":"VLOOKUP(H235,試験規格マスタ!A:H,2,FALSE)","v":"FCC_Part27"},{"$f":"VLOOKUP(B235,試験規格マスタ!H:H,1,FALSE)","v":"FCC Part27"}]
[232,"FCC Part74  ",2,0,0,null,0,"通信機器性能_FCC_Part74",null,null,{"$f":"VLOOKUP(H236,試験規格マスタ!A:H,2,FALSE)","v":"FCC_Part74"},{"$f":"VLOOKUP(B236,試験規格マスタ!H:H,1,FALSE)","v":"FCC Part74  "}]
[233,"FCC Part80  ",2,0,0,null,0,"通信機器性能_FCC_Part80",null,null,{"$f":"VLOOKUP(H237,試験規格マスタ!A:H,2,FALSE)","v":"FCC_Part80"},{"$f":"VLOOKUP(B237,試験規格マスタ!H:H,1,FALSE)","v":"FCC Part80  "}]
[234,"FCC Part90 ",2,0,0,null,0,"通信機器性能_FCC_Part90",null,null,{"$f":"VLOOKUP(H238,試験規格マスタ!A:H,2,FALSE)","v":"FCC_Part90"},{"$f":"VLOOKUP(B238,試験規格マスタ!H:H,1,FALSE)","v":"FCC Part90 "}]
[235,"FCC Part95",2,0,0,null,0,"通信機器性能_FCC_Part95",null,null,{"$f":"VLOOKUP(H239,試験規格マスタ!A:H,2,FALSE)","v":"FCC_Part95"},{"$f":"VLOOKUP(B239,試験規格マスタ!H:H,1,FALSE)","v":"FCC Part95"}]
[236,"FCC Part97",2,0,0,null,0,"通信機器性能_FCC_Part97",null,null,{"$f":"VLOOKUP(H240,試験規格マスタ!A:H,2,FALSE)","v":"FCC_Part97"},{"$f":"VLOOKUP(B240,試験規格マスタ!H:H,1,FALSE)","v":"FCC Part97"}]
[237,"IC RSS-Gen",2,0,0,null,0,"通信機器性能_IC_RSSGen",null,null,{"$f":"VLOOKUP(H241,試験規格マスタ!A:H,2,FALSE)","v":"IC_RSSGen"},{"$f":"VLOOKUP(B241,試験規格マスタ!H:H,1,FALSE)","v":"IC RSS-Gen"}]
[238,"IC RSS-210",2,0,0,null,0,"通信機器性能_IC_RSS210",null,null,{"$f":"VLOOKUP(H242,試験規格マスタ!A:H,2,FALSE)","v":"IC_RSS210"},{"$f":"VLOOKUP(B242,試験規格マスタ!H:H,1,FALSE)","v":"IC RSS-210"}]
[239,"IC RSS-247",2,0,0,null,0,"通信機器性能_IC_RSS247",null,null,{"$f":"VLOOKUP(H243,試験規格マスタ!A:H,2,FALSE)","v":"IC_RSS247"},{"$f":"VLOOKUP(B243,試験規格マスタ!H:H,1,FALSE)","v":"IC RSS-247"}]
[240,"IC RSS-310",2,0,0,null,0,"通信機器性能_IC_RSS310",null,null,{"$f":"VLOOKUP(H244,試験規格マスタ!A:H,2,FALSE)","v":"IC_RSS310"},{"$f":"VLOOKUP(B244,試験規格マスタ!H:H,1,FALSE)","v":"IC RSS-310"}]
[241,"IC RSS-118",2,0,0,null,0,"通信機器性能_IC_RSS118",null,null,{"$f":"VLOOKUP(H245,試験規格マスタ!A:H,2,FALSE)","v":"IC_RSS118"},{"$f":"VLOOKUP(B245,試験規格マスタ!H:H,1,FALSE)","v":"IC RSS-118"}]
[242,"IC RSS-132",2,0,0,null,0,"通信機器性能_IC_RSS132",null,null,{"$f":"VLOOKUP(H246,試験規格マスタ!A:H,2,FALSE)","v":"IC_RSS132"},{"$f":"VLOOKUP(B246,試験規格マスタ!H:H,1,FALSE)","v":"IC RSS-132"}]
[243,"IC RSS-133",2,0,0,null,0,"通信機器性能_IC_RSS133",null,null,{"$f":"VLOOKUP(H247,試験規格マスタ!A:H,2,FALSE)","v":"IC_RSS133"},{"$f":"VLOOKUP(B247,試験規格マスタ!H:H,1,FALSE)","v":"IC RSS-133"}]
[244,"IC RSS-119",2,0,0,null,0,"通信機器性能_IC_RSS119",null,null,{"$f":"VLOOKUP(H248,試験規格マスタ!A:H,2,FALSE)","v":"IC_RSS119"},{"$f":"VLOOKUP(B248,試験規格マスタ!H:H,1,FALSE)","v":"IC RSS-119"}]
[245,"IC RSS-135",2,0,0,null,0,"通信機器性能_IC_RSS135",null,null,{"$f":"VLOOKUP(H249,試験規格マスタ!A:H,2,FALSE)","v":"IC_RSS135"},{"$f":"VLOOKUP(B249,試験規格マスタ!H:H,1,FALSE)","v":"IC RSS-135"}]
[246,"IC RSS-215",2,0,0,null,0,"通信機器性能_IC_RSS215",null,null,{"$f":"VLOOKUP(H250,試験規格マスタ!A:H,2,FALSE)","v":"IC_RSS215"},{"$f":"VLOOKUP(B250,試験規格マスタ!H:H,1,FALSE)","v":"IC RSS-215"}]
[247,"EN 300 328 V1.9.1",2,0,0,null,0,"通信機器性能_EN300_328",null,null,{"$f":"VLOOKUP(H251,試験規格マスタ!A:H,2,FALSE)","v":"EN300_328"},{"$f":"VLOOKUP(B251,試験規格マスタ!H:H,1,FALSE)","v":"EN 300 328 V1.9.1"}]
[248,"EN300_328_SUB",2,1,1,null,0,"通信機器性能_EN300_328_SUB"]
[249,"EN300_328-1",2,1,1,null,0,"通信機器性能_EN300_328-1"]
[250,"EN300_328-2",2,1,1,null,0,"通信機器性能_EN300_328-2"]
[251,"EN 301 357-1 ",2,0,0,null,0,"通信機器性能_EN301_357-1",null,null,{"$f":"VLOOKUP(H255,試験規格マスタ!A:H,2,FALSE)","v":"EN301_357-1"},{"$f":"VLOOKUP(B255,試験規格マスタ!H:H,1,FALSE)","v":"EN 301 357-1 "}]
[252,"EN 301 357-2",2,0,0,null,0,"通信機器性能_EN301_357-2",null,null,{"$f":"VLOOKUP(H256,試験規格マスタ!A:H,2,FALSE)","v":"EN301_357-2"},{"$f":"VLOOKUP(B256,試験規格マスタ!H:H,1,FALSE)","v":"EN 301 357-2"}]
[253,"EN 301 893",2,0,0,null,0,"通信機器性能_EN301_893",null,null,{"$f":"VLOOKUP(H257,試験規格マスタ!A:H,2,FALSE)","v":"EN301_893"},{"$f":"VLOOKUP(B257,試験規格マスタ!H:H,1,FALSE)","v":"EN 301 893"}]
[254,"EN 300 086",2,0,0,null,0,"通信機器性能_EN300_086",null,null,{"$f":"VLOOKUP(H258,試験規格マスタ!A:H,2,FALSE)","v":"EN300_086"},{"$f":"VLOOKUP(B258,試験規格マスタ!H:H,1,FALSE)","v":"EN 300 086"}]
[255,"EN 300 086-1",2,0,0,null,0,"通信機器性能_EN300_086-1",null,null,{"$f":"VLOOKUP(H259,試験規格マスタ!A:H,2,FALSE)","v":"EN300_086-1"},{"$f":"VLOOKUP(B259,試験規格マスタ!H:H,1,FALSE)","v":"EN 300 086-1"}]
[256,"EN 300 086-2",2,0,0,null,0,"通信機器性能_EN300_086-2",null,null,{"$f":"VLOOKUP(H260,試験規格マスタ!A:H,2,FALSE)","v":"EN300_086-2"},{"$f":"VLOOKUP(B260,試験規格マスタ!H:H,1,FALSE)","v":"EN 300 086-2"}]
[257,"EN 300 219",2,0,0,null,0,"通信機器性能_EN300_219",null,null,{"$f":"VLOOKUP(H261,試験規格マスタ!A:H,2,FALSE)","v":"EN300_219"},{"$f":"VLOOKUP(B261,試験規格マスタ!H:H,1,FALSE)","v":"EN 300 219"}]
[258,"EN 300 219-1",2,0,0,null,0,"通信機器性能_EN300_219-1",null,null,{"$f":"VLOOKUP(H262,試験規格マスタ!A:H,2,FALSE)","v":"EN300_219-1"},{"$f":"VLOOKUP(B262,試験規格マスタ!H:H,1,FALSE)","v":"EN 300 219-1"}]
[259,"EN 300 219-2",2,0,0,null,0,"通信機器性能_EN300_219-2",null,null,{"$f":"VLOOKUP(H263,試験規格マスタ!A:H,2,FALSE)","v":"EN300_219-2"},{"$f":"VLOOKUP(B263,試験規格マスタ!H:H,1,FALSE)","v":"EN 300 219-2"}]
[260,"EN 300 113",2,0,0,null,0,"通信機器性能_EN300_113",null,null,{"$f":"VLOOKUP(H264,試験規格マスタ!A:H,2,FALSE)","v":"EN300_113"},{"$f":"VLOOKUP(B264,試験規格マスタ!H:H,1,FALSE)","v":"EN 300 113"}]
[261,"EN 300 113-1",2,0,0,null,0,"通信機器性能_EN300_113-1",null,null,{"$f":"VLOOKUP(H265,試験規格マスタ!A:H,2,FALSE)","v":"EN300_113-1"},{"$f":"VLOOKUP(B265,試験規格マスタ!H:H,1,FALSE)","v":"EN 300 113-1"}]
[262,"EN 300 113-2",2,0,0,null,0,"通信機器性能_EN300_113-2",null,null,{"$f":"VLOOKUP(H266,試験規格マスタ!A:H,2,FALSE)","v":"EN300_113-2"},{"$f":"VLOOKUP(B266,試験規格マスタ!H:H,1,FALSE)","v":"EN 300 113-2"}]
[263,"EN 301 166",2,0,0,null,0,"通信機器性能_EN301_166",null,null,{"$f":"VLOOKUP(H267,試験規格マスタ!A:H,2,FALSE)","v":"EN301_166"},{"$f":"VLOOKUP(B267,試験規格マスタ!H:H,1,FALSE)","v":"EN 301 166"}]
[264,"EN 301 166-1",2,0,0,null,0,"通信機器性能_EN301_166-1",null,null,{"$f":"VLOOKUP(H268,試験規格マスタ!A:H,2,FALSE)","v":"EN301_166-1"},{"$f":"VLOOKUP(B268,試験規格マスタ!H:H,1,FALSE)","v":"EN 301 166-1"}]
[265,"EN 301 166-2",2,0,0,null,0,"通信機器性能_EN301_166-2",null,null,{"$f":"VLOOKUP(H269,試験規格マスタ!A:H,2,FALSE)","v":"EN301_166-2"},{"$f":"VLOOKUP(B269,試験規格マスタ!H:H,1,FALSE)","v":"EN 301 166-2"}]
[266,"EN 301 489-1",2,0,0,null,0,"通信機器性能_EN301_489-1",null,null,{"$f":"VLOOKUP(H270,試験規格マスタ!A:H,2,FALSE)","v":"EN301_489-1"},{"$f":"VLOOKUP(B270,試験規格マスタ!H:H,1,FALSE)","v":"EN 301 489-1"}]
[267,"EN 301 489-",2,0,0,"J-7",0,"通信機器性能_EN301_489_SUB",null,null,{"$f":"VLOOKUP(H271,試験規格マスタ!A:H,2,FALSE)","v":"EN301_489"},{"$f":"VLOOKUP(B271,試験規格マスタ!H:H,1,FALSE)","v":"EN 301 489-"}]
[268,"EN 301 511",2,0,0,null,0,"通信機器性能_EN301_511",null,null,{"$f":"VLOOKUP(H272,試験規格マスタ!A:H,2,FALSE)","v":"EN301_511"},{"$f":"VLOOKUP(B272,試験規格マスタ!H:H,1,FALSE)","v":"EN 301 511"}]
[269,"EN 301 908-1",2,0,0,null,0,"通信機器性能_EN301_908-1",null,null,{"$f":"VLOOKUP(H273,試験規格マスタ!A:H,2,FALSE)","v":"EN301_908-1"},{"$f":"VLOOKUP(B273,試験規格マスタ!H:H,1,FALSE)","v":"EN 301 908-1"}]
[270,"EN 302 291-1",2,0,0,null,0,"通信機器性能_EN302_291-1",null,null,{"$f":"VLOOKUP(H274,試験規格マスタ!A:H,2,FALSE)","v":"EN302_291-1"},{"$f":"VLOOKUP(B274,試験規格マスタ!H:H,1,FALSE)","v":"EN 302 291-1"}]
[271,"EN 302 291-2",2,0,0,null,0,"通信機器性能_EN302_291-2",null,null,{"$f":"VLOOKUP(H275,試験規格マスタ!A:H,2,FALSE)","v":"EN302_291-2"},{"$f":"VLOOKUP(B275,試験規格マスタ!H:H,1,FALSE)","v":"EN 302 291-2"}]
[272,"EN 300 220",2,0,0,null,0,"通信機器性能_EN300_220",null,null,{"$f":"VLOOKUP(H276,試験規格マスタ!A:H,2,FALSE)","v":"EN300_220"},{"$f":"VLOOKUP(B276,試験規格マスタ!H:H,1,FALSE)","v":"EN 300 220"}]
[273,"EN 300 220-1",2,0,0,null,0,"通信機器性能_EN300_220-1",null,null,{"$f":"VLOOKUP(H277,試験規格マスタ!A:H,2,FALSE)","v":"EN300_220-1"},{"$f":"VLOOKUP(B277,試験規格マスタ!H:H,1,FALSE)","v":"EN 300 220-1"}]
[274,"EN 300 220-2",2,0,0,null,0,"通信機器性能_EN300_220-2",null,null,{"$f":"VLOOKUP(H278,試験規格マスタ!A:H,2,FALSE)","v":"EN300_220-2"},{"$f":"VLOOKUP(B278,試験規格マスタ!H:H,1,FALSE)","v":"EN 300 220-2"}]
[275,"EN 300 330",2,0,0,null,0,"通信機器性能_EN300_330",null,null,{"$f":"VLOOKUP(H279,試験規格マスタ!A:H,2,FALSE)","v":"EN300_330"},{"$f":"VLOOKUP(B279,試験規格マスタ!H:H,1,FALSE)","v":"EN 300 330"}]
[276,"EN 300 330-1",2,0,0,null,0,"通信機器性能_EN300_330-1",null,null,{"$f":"VLOOKUP(H280,試験規格マスタ!A:H,2,FALSE)","v":"EN300_330-1"},{"$f":"VLOOKUP(B280,試験規格マスタ!H:H,1,FALSE)","v":"EN 300 330-1"}]
[277,"EN 300 330-2",2,0,0,null,0,"通信機器性能_EN300_330-2",null,null,{"$f":"VLOOKUP(H281,試験規格マスタ!A:H,2,FALSE)","v":"EN300_330-2"},{"$f":"VLOOKUP(B281,試験規格マスタ!H:H,1,FALSE)","v":"EN 300 330-2"}]
[278,"EN 300 440",2,0,0,null,0,"通信機器性能_EN300_440",null,null,{"$f":"VLOOKUP(H282,試験規格マスタ!A:H,2,FALSE)","v":"EN300_440"},{"$f":"VLOOKUP(B282,試験規格マスタ!H:H,1,FALSE)","v":"EN 300 440"}]
[279,"EN 300 440-1",2,0,0,null,0,"通信機器性能_EN300_440-1",null,null,{"$f":"VLOOKUP(H283,試験規格マスタ!A:H,2,FALSE)","v":"EN300_440-1"},{"$f":"VLOOKUP(B283,試験規格マスタ!H:H,1,FALSE)","v":"EN 300 440-1"}]
[280,"EN 300 440-2",2,0,0,null,0,"通信機器性能_EN300_440-2",null,null,{"$f":"VLOOKUP(H284,試験規格マスタ!A:H,2,FALSE)","v":"EN300_440-2"},{"$f":"VLOOKUP(B284,試験規格マスタ!H:H,1,FALSE)","v":"EN 300 440-2"}]
[281,"EN 300 422",2,0,0,null,0,"通信機器性能_EN300_422",null,null,{"$f":"VLOOKUP(H285,試験規格マスタ!A:H,2,FALSE)","v":"EN300_422"},{"$f":"VLOOKUP(B285,試験規格マスタ!H:H,1,FALSE)","v":"EN 300 422"}]
[282,"EN 300 422-1",2,0,0,null,0,"通信機器性能_EN300_422-1",null,null,{"$f":"VLOOKUP(H286,試験規格マスタ!A:H,2,FALSE)","v":"EN300_422-1"},{"$f":"VLOOKUP(B286,試験規格マスタ!H:H,1,FALSE)","v":"EN 300 422-1"}]
[283,"EN 300 422-2",2,0,0,null,0,"通信機器性能_EN300_422-2",null,null,{"$f":"VLOOKUP(H287,試験規格マスタ!A:H,2,FALSE)","v":"EN300_422-2"},{"$f":"VLOOKUP(B287,試験規格マスタ!H:H,1,FALSE)","v":"EN 300 422-2"}]
[284,"記載のない試験規格をご希望の場合はここにご記入ください",2,0,2,null,0]
[285,"20．試験規格－通信機性能 ２",1,0,0,null,1,"通信機器性能2",null,null,{"$f":"VLOOKUP(H289,試験規格マスタ!A:H,2,FALSE)","v":"通信機性能 2"},{"$f":"VLOOKUP(B289,試験規格マスタ!H:H,1,FALSE)","v":"20．試験規格－通信機性能 ２"}]
[286,"IEC 62209 Part 1",2,0,0,null,0,"通信機器性能2_IEC62209_Part1",null,null,{"$f":"VLOOKUP(H290,試験規格マスタ!A:H,2,FALSE)","v":"IEC62209_Part1"},{"$f":"VLOOKUP(B290,試験規格マスタ!H:H,1,FALSE)","v":"IEC 62209 Part 1"}]
[287,"IEC 62209 Part 2 ",2,0,0,null,0,"通信機器性能2_IEC62209_Part2",null,null,{"$f":"VLOOKUP(H291,試験規格マスタ!A:H,2,FALSE)","v":"IEC62209_Part2"},{"$f":"VLOOKUP(B291,試験規格マスタ!H:H,1,FALSE)","v":"IEC 62209 Part 2 "}]
[288,"EN 62209-1",2,0,0,null,0,"通信機器性能2_EN62209-1",null,null,{"$f":"VLOOKUP(H292,試験規格マスタ!A:H,2,FALSE)","v":"EN62209-1"},{"$f":"VLOOKUP(B292,試験規格マスタ!H:H,1,FALSE)","v":"EN 62209-1"}]
[289,"EN 62209-2",2,0,0,null,0,"通信機器性能2_EN62209-2",null,null,{"$f":"VLOOKUP(H293,試験規格マスタ!A:H,2,FALSE)","v":"EN62209-2"},{"$f":"VLOOKUP(B293,試験規格マスタ!H:H,1,FALSE)","v":"EN 62209-2"}]
[290,"EN 50383",2,0,0,null,0,"通信機器性能2_EN50383",null,null,{"$f":"VLOOKUP(H294,試験規格マスタ!A:H,2,FALSE)","v":"EN50383"},{"$f":"VLOOKUP(B294,試験規格マスタ!H:H,1,FALSE)","v":"EN 50383"}]
[291,"FCC OET65/Supplement C",2,0,0,null,0,"通信機器性能2_FCC_OET65_SupplementC",null,null,{"$f":"VLOOKUP(H295,試験規格マスタ!A:H,2,FALSE)","v":"FCC_OET65/Supplement C"},{"$f":"VLOOKUP(B295,試験規格マスタ!H:H,1,FALSE)","v":"FCC OET65/Supplement C"}]
[292,"FCC ANSI/IEEE1528",2,0,0,null,0,"通信機器性能2_FCC_ANSI_ＩEEE1528",null,null,{"$f":"VLOOKUP(H296,試験規格マスタ!A:H,2,FALSE)","v":"FCC_ANSI/ＩEEE1528"},{"$f":"VLOOKUP(B296,試験規格マスタ!H:H,1,FALSE)","v":"FCC ANSI/IEEE1528"}]
[293,"IC RSS102",2,0,0,null,0,"通信機器性能2_IC_RSS102",null,null,{"$f":"VLOOKUP(H297,試験規格マスタ!A:H,2,FALSE)","v":"IC_RSS102"},{"$f":"VLOOKUP(B297,試験規格マスタ!H:H,1,FALSE)","v":"IC RSS102"}]
[294,"IEC 62311",2,0,0,null,0,"通信機器性能2_IEC62311",null,null,{"$f":"VLOOKUP(H298,試験規格マスタ!A:H,2,FALSE)","v":"IEC62311"},{"$f":"VLOOKUP(B298,試験規格マスタ!H:H,1,FALSE)","v":"IEC 62311"}]
[295,"EN 62311",2,0,0,null,0,"通信機器性能2_EN62311",null,null,{"$f":"VLOOKUP(H299,試験規格マスタ!A:H,2,FALSE)","v":"EN62311"},{"$f":"VLOOKUP(B299,試験規格マスタ!H:H,1,FALSE)","v":"EN 62311"}]
[296,"EN 62369-1",2,0,0,null,0,"通信機器性能2_EN62369-1",null,null,{"$f":"VLOOKUP(H300,試験規格マスタ!A:H,2,FALSE)","v":"EN62369-1"},{"$f":"VLOOKUP(B300,試験規格マスタ!H:H,1,FALSE)","v":"EN 62369-1"}]
[297,"IEC 62369-1",2,0,0,null,0,"通信機器性能2_IEC62369-1",null,null,{"$f":"VLOOKUP(H301,試験規格マスタ!A:H,2,FALSE)","v":"IEC62369-1"},{"$f":"VLOOKUP(B301,試験規格マスタ!H:H,1,FALSE)","v":"IEC 62369-1"}]
[298,"EN 50371",2,0,0,null,0,"通信機器性能2_EN50371",null,null,{"$f":"VLOOKUP(H302,試験規格マスタ!A:H,2,FALSE)","v":"EN50371"},{"$f":"VLOOKUP(B302,試験規格マスタ!H:H,1,FALSE)","v":"EN 50371"}]
[299,"IEC 62479",2,0,0,null,0,"通信機器性能2_IEC62479",null,null,{"$f":"VLOOKUP(H303,試験規格マスタ!A:H,2,FALSE)","v":"IEC62479"},{"$f":"VLOOKUP(B303,試験規格マスタ!H:H,1,FALSE)","v":"IEC 62479"}]
[300,"EN 62479",2,0,0,null,0,"通信機器性能2_EN62479",null,null,{"$f":"VLOOKUP(H304,試験規格マスタ!A:H,2,FALSE)","v":"EN62479"},{"$f":"VLOOKUP(B304,試験規格マスタ!H:H,1,FALSE)","v":"EN 62479"}]
[301,"EN 50385",2,0,0,null,0,"通信機器性能2_EN50385",null,null,{"$f":"VLOOKUP(H305,試験規格マスタ!A:H,2,FALSE)","v":"EN50385"},{"$f":"VLOOKUP(B305,試験規格マスタ!H:H,1,FALSE)","v":"EN 50385"}]
[302,"EN 50566",2,0,0,null,0,"通信機器性能2_EN50566",null,null,{"$f":"VLOOKUP(H306,試験規格マスタ!A:H,2,FALSE)","v":"EN50566"},{"$f":"VLOOKUP(B306,試験規格マスタ!H:H,1,FALSE)","v":"EN 50566"}]
[303,"EN 50364",2,0,0,null,0,"通信機器性能2_EN50364",null,null,{"$f":"VLOOKUP(H307,試験規格マスタ!A:H,2,FALSE)","v":"EN50364"},{"$f":"VLOOKUP(B307,試験規格マスタ!H:H,1,FALSE)","v":"EN 50364"}]
[304,"IEC 62233",2,0,0,null,0,"通信機器性能2_IEC62233",null,null,{"$f":"VLOOKUP(H308,試験規格マスタ!A:H,2,FALSE)","v":"IEC62233"},{"$f":"VLOOKUP(B308,試験規格マスタ!H:H,1,FALSE)","v":"IEC 62233"}]
[305,"EN 62233",2,0,0,null,0,"通信機器性能2_EN62233",null,null,{"$f":"VLOOKUP(H309,試験規格マスタ!A:H,2,FALSE)","v":"EN62233"},{"$f":"VLOOKUP(B309,試験規格マスタ!H:H,1,FALSE)","v":"EN 62233"}]
[306,"EN 50360",2,0,0,null,0,"通信機器性能2_EN50360",null,null,{"$f":"VLOOKUP(H310,試験規格マスタ!A:H,2,FALSE)","v":"EN50360"},{"$f":"VLOOKUP(B310,試験規格マスタ!H:H,1,FALSE)","v":"EN 50360"}]
[307,"EN 50361",2,0,0,null,0,"通信機器性能2_EN50361",null,null,{"$f":"VLOOKUP(H311,試験規格マスタ!A:H,2,FALSE)","v":"EN50361"},{"$f":"VLOOKUP(B311,試験規格マスタ!H:H,1,FALSE)","v":"EN 50361"}]
[308,"EN 50366",2,0,0,null,0,"通信機器性能2_EN50366",null,null,{"$f":"VLOOKUP(H312,試験規格マスタ!A:H,2,FALSE)","v":"EN50366"},{"$f":"VLOOKUP(B312,試験規格マスタ!H:H,1,FALSE)","v":"EN 50366"}]
[309,"総務省令無線設備規則（局所比吸収率）",2,0,0,null,0,"通信機器性能2_総務省令無線設備規則_局所比吸収率",null,null,{"$f":"VLOOKUP(H313,試験規格マスタ!A:H,2,FALSE)","v":"総務省令無線設備規則(局所比吸収率)"},{"$f":"VLOOKUP(B313,試験規格マスタ!H:H,1,FALSE)","v":"総務省令無線設備規則（局所比吸収率）"}]
[310,"ARIB STD-T56　",2,0,0,null,0,"通信機器性能2_ARIB_STD-T56",null,null,{"$f":"VLOOKUP(H314,試験規格マスタ!A:H,2,FALSE)","v":"ARIB_STD-T56"},{"$f":"VLOOKUP(B314,試験規格マスタ!H:H,1,FALSE)","v":"ARIB STD-T56　"}]
[311,"記載のない試験規格をご希望の場合はここにご記入ください",2,0,2,null,0]
[312,"21．試験規格－通信機性能 ３",1,0,0,null,1,"通信機器性能3",null,null,{"$f":"VLOOKUP(H316,試験規格マスタ!A:H,2,FALSE)","v":"通信機性能 3"},{"$f":"VLOOKUP(B316,試験規格マスタ!H:H,1,FALSE)","v":"21．試験規格－通信機性能 ３"}]
[313,"FCC Part68",2,0,0,null,0,"通信機器性能3_FCC_Part68",null,null,{"$f":"VLOOKUP(H317,試験規格マスタ!A:H,2,FALSE)","v":"FCC_Part68"},{"$f":"VLOOKUP(B317,試験規格マスタ!H:H,1,FALSE)","v":"FCC Part68"}]
[314,"ANSI/TIA-968-B, B-1",2,0,0,null,0,"通信機器性能3_ANSI/TIA-968-B,B-1",null,null,{"$f":"VLOOKUP(H318,試験規格マスタ!A:H,2,FALSE)","v":"ANSI/TIA-968-B, B-1"},{"$f":"VLOOKUP(B318,試験規格マスタ!H:H,1,FALSE)","v":"ANSI/TIA-968-B, B-1"}]
[315,"IC CS-03",2,0,0,null,0,"通信機器性能3_IC_CS-03",null,null,{"$f":"VLOOKUP(H319,試験規格マスタ!A:H,2,FALSE)","v":"IC_CS-03"},{"$f":"VLOOKUP(B319,試験規格マスタ!H:H,1,FALSE)","v":"IC CS-03"}]
[316,"記載のない試験規格をご希望の場合はここにご記入ください",2,0,2,null,0]
[317,"22．試験規格－環境（消費電力）（注：本項を申請する場合は、事前にVLACにご相談ください。）",1,0,0,null,1,"環境",null,null,{"$f":"VLOOKUP(H321,試験規格マスタ!A:H,2,FALSE)","v":"環境（消費電力）"},{"$f":"VLOOKUP(B321,試験規格マスタ!H:H,1,FALSE)","v":"22．試験規格－環境（消費電力）（注：本項を申請する場合は、事前にVLACにご相談ください。）"}]
[318,"国際エネルギースタープログラム運用細則",2,0,0,null,0,"環境_国際",null,null,{"$f":"VLOOKUP(H322,試験規格マスタ!A:H,2,FALSE)","v":"国際エネルギースタープログラム運用細則"},{"$f":"VLOOKUP(B322,試験規格マスタ!H:H,1,FALSE)","v":"国際エネルギースタープログラム運用細則"}]
[319,"コンピュータ類",3,0,0,null,0,"環境_国際_コンピュータ",null,null,{"$f":"VLOOKUP(H323,試験規格マスタ!A:H,2,FALSE)","v":"コンピュータ類"},{"$f":"VLOOKUP(B323,試験規格マスタ!H:H,1,FALSE)","v":"コンピュータ類"}]
[320,"デスクトップ",4,0,0,null,0,"環境_国際_コンピュータ_デスクトップ",null,null,{"$f":"VLOOKUP(H324,試験規格マスタ!A:H,2,FALSE)","v":"デスクトップ"},{"$f":"VLOOKUP(B324,試験規格マスタ!H:H,1,FALSE)","v":"デスクトップ"}]
[321,"ノートブック",4,0,0,null,0,"環境_国際_コンピュータ_ノートブック",null,null,{"$f":"VLOOKUP(H325,試験規格マスタ!A:H,2,FALSE)","v":"ノートブック"},{"$f":"VLOOKUP(B325,試験規格マスタ!H:H,1,FALSE)","v":"ノートブック"}]
[322,"一体型デスクトップ",4,0,0,null,0,"環境_国際_コンピュータ_一体型デスクトップ",null,null,{"$f":"VLOOKUP(H326,試験規格マスタ!A:H,2,FALSE)","v":"一体型デスクトップ"},{"$f":"VLOOKUP(B326,試験規格マスタ!H:H,1,FALSE)","v":"一体型デスクトップ"}]
[323,"ワークステーション",4,0,0,null,0,"環境_国際_コンピュータ_ワークステーション",null,null,{"$f":"VLOOKUP(H327,試験規格マスタ!A:H,2,FALSE)","v":"ワークステーション"},{"$f":"VLOOKUP(B327,試験規格マスタ!H:H,1,FALSE)","v":"ワークステーション"}]
[324,"小型サーバー",4,0,0,null,0,"環境_国際_コンピュータ_小型サーバー",null,null,{"$f":"VLOOKUP(H328,試験規格マスタ!A:H,2,FALSE)","v":"小型サーバー"},{"$f":"VLOOKUP(B328,試験規格マスタ!H:H,1,FALSE)","v":"小型サーバー"}]
[325,"シンクライアント",4,0,0,null,0,"環境_国際_コンピュータ_シンクライアント",null,null,{"$f":"VLOOKUP(H329,試験規格マスタ!A:H,2,FALSE)","v":"シンクライアント"},{"$f":"VLOOKUP(B329,試験規格マスタ!H:H,1,FALSE)","v":"シンクライアント"}]
[326,"ディスプレイ類",3,0,0,null,0,"環境_国際_ディスプレイ",null,null,{"$f":"VLOOKUP(H330,試験規格マスタ!A:H,2,FALSE)","v":"ディスプレイ類"},{"$f":"VLOOKUP(B330,試験規格マスタ!H:H,1,FALSE)","v":"ディスプレイ類"}]
[327,"CRTディスプレイ",4,0,0,null,0,"環境_国際_ディスプレイ_CRTディスプレイ",null,null,{"$f":"VLOOKUP(H331,試験規格マスタ!A:H,2,FALSE)","v":"CRTディスプレイ"},{"$f":"VLOOKUP(B331,試験規格マスタ!H:H,1,FALSE)","v":"CRTディスプレイ"}]
[328,"30インチ未満",4,0,0,null,0,"環境_国際_ディスプレイ_30インチ未満",null,null,{"$f":"VLOOKUP(H332,試験規格マスタ!A:H,2,FALSE)","v":"30インチ未満"},{"$f":"VLOOKUP(B332,試験規格マスタ!H:H,1,FALSE)","v":"30インチ未満"}]
[329,"30インチ以上",4,0,0,null,0,"環境_国際_ディスプレイ_30インチ以上",null,null,{"$f":"VLOOKUP(H333,試験規格マスタ!A:H,2,FALSE)","v":"30インチ以上"},{"$f":"VLOOKUP(B333,試験規格マスタ!H:H,1,FALSE)","v":"30インチ以上"}]
[330,"固定画素ディスプレイ",4,0,0,null,0,"環境_国際_ディスプレイ_固定画素ディスプレイ",null,null,{"$f":"VLOOKUP(H334,試験規格マスタ!A:H,2,FALSE)","v":"固定画素ディスプレイ"},{"$f":"VLOOKUP(B334,試験規格マスタ!H:H,1,FALSE)","v":"固定画素ディスプレイ"}]
[331,"画像機器類",3,0,0,null,0,"環境_国際_画像機器",null,null,{"$f":"VLOOKUP(H335,試験規格マスタ!A:H,2,FALSE)","v":"画像機器類"},{"$f":"VLOOKUP(B335,試験規格マスタ!H:H,1,FALSE)","v":"画像機器類"}]
[332,"プリンタ",4,0,0,null,0,"環境_国際_画像機器_プリンタ",null,null,{"$f":"VLOOKUP(H336,試験規格マスタ!A:H,2,FALSE)","v":"プリンタ"},{"$f":"VLOOKUP(B336,試験規格マスタ!H:H,1,FALSE)","v":"プリンタ"}]
[333,"複写機",4,0,0,null,0,"環境_国際_画像機器_複写機",null,null,{"$f":"VLOOKUP(H337,試験規格マスタ!A:H,2,FALSE)","v":"複写機"},{"$f":"VLOOKUP(B337,試験規格マスタ!H:H,1,FALSE)","v":"複写機"}]
[334,"ファクシミリ",4,0,0,null,0,"環境_国際_画像機器_ファクシミリ",null,null,{"$f":"VLOOKUP(H338,試験規格マスタ!A:H,2,FALSE)","v":"ファクシミリ"},{"$f":"VLOOKUP(B338,試験規格マスタ!H:H,1,FALSE)","v":"ファクシミリ"}]
[335,"スキャナ",4,0,0,null,0,"環境_国際_画像機器_スキャナ",null,null,{"$f":"VLOOKUP(H339,試験規格マスタ!A:H,2,FALSE)","v":"スキャナ"},{"$f":"VLOOKUP(B339,試験規格マスタ!H:H,1,FALSE)","v":"スキャナ"}]
[336,"複合機",4,0,0,null,0,"環境_国際_画像機器_複合機",null,null,{"$f":"VLOOKUP(H340,試験規格マスタ!A:H,2,FALSE)","v":"複合機"},{"$f":"VLOOKUP(B340,試験規格マスタ!H:H,1,FALSE)","v":"複合機"}]
[337,"ディジタル印刷機",4,0,0,null,0,"環境_国際_画像機器_ディジタル印刷機",null,null,{"$f":"VLOOKUP(H341,試験規格マスタ!A:H,2,FALSE)","v":"ディジタル印刷機"},{"$f":"VLOOKUP(B341,試験規格マスタ!H:H,1,FALSE)","v":"ディジタル印刷機"}]
[338,"米国エネルギースタープログラム",2,0,0,null,0,"環境_米国",null,null,{"$f":"VLOOKUP(H342,試験規格マスタ!A:H,2,FALSE)","v":"米国エネルギースタープログラム運用細則"},{"$f":"VLOOKUP(B342,試験規格マスタ!H:H,1,FALSE)","v":"米国エネルギースタープログラム"}]
[339,"コンピュータ類",3,0,0,null,0,"環境_米国_コンピュータ",null,null,{"$f":"VLOOKUP(H343,試験規格マスタ!A:H,2,FALSE)","v":"コンピュータ"},{"$f":"VLOOKUP(B343,試験規格マスタ!H:H,1,FALSE)","v":"コンピュータ類"}]
[340,"デスクトップ",4,0,0,null,0,"環境_米国_コンピュータ_デスクトップ",null,null,{"$f":"VLOOKUP(H344,試験規格マスタ!A:H,2,FALSE)","v":"デスクトップ"},{"$f":"VLOOKUP(B344,試験規格マスタ!H:H,1,FALSE)","v":"デスクトップ"}]
[341,"ノートブック",4,0,0,null,0,"環境_米国_コンピュータ_ノートブック",null,null,{"$f":"VLOOKUP(H345,試験規格マスタ!A:H,2,FALSE)","v":"ノートブック"},{"$f":"VLOOKUP(B345,試験規格マスタ!H:H,1,FALSE)","v":"ノートブック"}]
[342,"一体型デスクトップ",4,0,0,null,0,"環境_米国_コンピュータ_一体型デスクトップ",null,null,{"$f":"VLOOKUP(H346,試験規格マスタ!A:H,2,FALSE)","v":"一体型デスクトップ"},{"$f":"VLOOKUP(B346,試験規格マスタ!H:H,1,FALSE)","v":"一体型デスクトップ"}]
[343,"ワークステーション",4,0,0,null,0,"環境_米国_コンピュータ_ワークステーション",null,null,{"$f":"VLOOKUP(H347,試験規格マスタ!A:H,2,FALSE)","v":"ワークステーション"},{"$f":"VLOOKUP(B347,試験規格マスタ!H:H,1,FALSE)","v":"ワークステーション"}]
[344,"小型サーバー",4,0,0,null,0,"環境_米国_コンピュータ_小型サーバー",null,null,{"$f":"VLOOKUP(H348,試験規格マスタ!A:H,2,FALSE)","v":"小型サーバー"},{"$f":"VLOOKUP(B348,試験規格マスタ!H:H,1,FALSE)","v":"小型サーバー"}]
[345,"シンクライアント",4,0,0,null,0,"環境_米国_コンピュータ_シンクライアント",null,null,{"$f":"VLOOKUP(H349,試験規格マスタ!A:H,2,FALSE)","v":"シンクライアント"},{"$f":"VLOOKUP(B349,試験規格マスタ!H:H,1,FALSE)","v":"シンクライアント"}]
[346,"ディスプレイ類",3,0,0,null,0,"環境_米国_ディスプレイ",null,null,{"$f":"VLOOKUP(H350,試験規格マスタ!A:H,2,FALSE)","v":"ディスプレイ"},{"$f":"VLOOKUP(B350,試験規格マスタ!H:H,1,FALSE)","v":"ディスプレイ類"}]
[347,"CRTディスプレイ",4,0,0,null,0,"環境_米国_ディスプレイ_CRTディスプレイ",null,null,{"$f":"VLOOKUP(H351,試験規格マスタ!A:H,2,FALSE)","v":"CRTディスプレイ"},{"$f":"VLOOKUP(B351,試験規格マスタ!H:H,1,FALSE)","v":"CRTディスプレイ"}]
[348,"30インチ未満",4,0,0,null,0,"環境_米国_ディスプレイ_30インチ未満",null,null,{"$f":"VLOOKUP(H352,試験規格マスタ!A:H,2,FALSE)","v":"30インチ未満"},{"$f":"VLOOKUP(B352,試験規格マスタ!H:H,1,FALSE)","v":"30インチ未満"}]
[349,"30インチ以上",4,0,0,null,0,"環境_米国_ディスプレイ_30インチ以上",null,null,{"$f":"VLOOKUP(H353,試験規格マスタ!A:H,2,FALSE)","v":"30インチ以上"},{"$f":"VLOOKUP(B353,試験規格マスタ!H:H,1,FALSE)","v":"30インチ以上"}]
[350,"固定画素ディスプレイ",4,0,0,null,0,"環境_米国_ディスプレイ_固定画素ディスプレイ",null,null,{"$f":"VLOOKUP(H354,試験規格マスタ!A:H,2,FALSE)","v":"固定画素ディスプレイ"},{"$f":"VLOOKUP(B354,試験規格マスタ!H:H,1,FALSE)","v":"固定画素ディスプレイ"}]
[351,"画像機器類",3,0,0,null,0,"環境_米国_画像機器",null,null,{"$f":"VLOOKUP(H355,試験規格マスタ!A:H,2,FALSE)","v":"画像機器"},{"$f":"VLOOKUP(B355,試験規格マスタ!H:H,1,FALSE)","v":"画像機器類"}]
[352,"プリンタ",4,0,0,null,0,"環境_米国_画像機器_プリンタ",null,null,{"$f":"VLOOKUP(H356,試験規格マスタ!A:H,2,FALSE)","v":"プリンタ"},{"$f":"VLOOKUP(B356,試験規格マスタ!H:H,1,FALSE)","v":"プリンタ"}]
[353,"複写機",4,0,0,null,0,"環境_米国_画像機器_複写機",null,null,{"$f":"VLOOKUP(H357,試験規格マスタ!A:H,2,FALSE)","v":"複写機"},{"$f":"VLOOKUP(B357,試験規格マスタ!H:H,1,FALSE)","v":"複写機"}]
[354,"ファクシミリ",4,0,0,null,0,"環境_米国_画像機器_ファクシミリ",null,null,{"$f":"VLOOKUP(H358,試験規格マスタ!A:H,2,FALSE)","v":"ファクシミリ"},{"$f":"VLOOKUP(B358,試験規格マスタ!H:H,1,FALSE)","v":"ファクシミリ"}]
[355,"スキャナ",4,0,0,null,0,"環境_米国_画像機器_スキャナ",null,null,{"$f":"VLOOKUP(H359,試験規格マスタ!A:H,2,FALSE)","v":"スキャナ"},{"$f":"VLOOKUP(B359,試験規格マスタ!H:H,1,FALSE)","v":"スキャナ"}]
[356,"複合機",4,0,0,null,0,"環境_米国_画像機器_複合機",null,null,{"$f":"VLOOKUP(H360,試験規格マスタ!A:H,2,FALSE)","v":"複合機"},{"$f":"VLOOKUP(B360,試験規格マスタ!H:H,1,FALSE)","v":"複合機"}]
[357,"ディジタル印刷機",4,0,0,null,0,"環境_米国_画像機器_ディジタル印刷機",null,null,{"$f":"VLOOKUP(H361,試験規格マスタ!A:H,2,FALSE)","v":"ディジタル印刷機"},{"$f":"VLOOKUP(B361,試験規格マスタ!H:H,1,FALSE)","v":"ディジタル印刷機"}]
[358,"郵便機器",4,0,0,null,0,"環境_米国_画像機器_郵便機器",null,null,{"$f":"VLOOKUP(H362,試験規格マスタ!A:H,2,FALSE)","v":"郵便機器"},{"$f":"VLOOKUP(B362,試験規格マスタ!H:H,1,FALSE)","v":"郵便機器"}]
[359,"テレビジョン受信機",3,0,0,null,0,"環境_米国_テレビジョン受信機",null,null,{"$f":"VLOOKUP(H363,試験規格マスタ!A:H,2,FALSE)","v":"テレビジョン受信機"},{"$f":"VLOOKUP(B363,試験規格マスタ!H:H,1,FALSE)","v":"テレビジョン受信機"}]
[360,"コンピューターサーバー",3,0,0,null,0,"環境_米国_コンピューターサーバー",null,null,{"$f":"VLOOKUP(H364,試験規格マスタ!A:H,2,FALSE)","v":"コンピューターサーバー"},{"$f":"VLOOKUP(B364,試験規格マスタ!H:H,1,FALSE)","v":"コンピューターサーバー"}]
[361,"電話機器",3,0,0,null,0,"環境_米国_電話機器",null,null,{"$f":"VLOOKUP(H365,試験規格マスタ!A:H,2,FALSE)","v":"電話機器"},{"$f":"VLOOKUP(B365,試験規格マスタ!H:H,1,FALSE)","v":"電話機器"}]
[362,"エネルギーラベル",2,0,0,null,0,"環境_エネルギーラベル",null,null,{"$f":"VLOOKUP(H366,試験規格マスタ!A:H,2,FALSE)","v":"エネルギーラベル"},{"$f":"VLOOKUP(B366,試験規格マスタ!H:H,1,FALSE)","v":"エネルギーラベル"}]
[363,"家庭用冷蔵庫/冷凍庫",3,0,0,null,0,"環境_エネルギーラベル_家庭用冷蔵庫/冷凍庫",null,null,{"$f":"VLOOKUP(H367,試験規格マスタ!A:H,2,FALSE)","v":"家庭用冷蔵庫/冷凍庫"},{"$f":"VLOOKUP(B367,試験規格マスタ!H:H,1,FALSE)","v":"家庭用冷蔵庫/冷凍庫"}]
[364,"IEC62552",4,0,0,null,0,"環境_エネルギーラベル_家庭用冷蔵庫/冷凍庫_IEC62552",null,null,{"$f":"VLOOKUP(H368,試験規格マスタ!A:H,2,FALSE)","v":"IEC62552"},{"$f":"VLOOKUP(B368,試験規格マスタ!H:H,1,FALSE)","v":"IEC62552"}]
[365,"JIS C 9801",4,0,0,null,0,"環境_エネルギーラベル_家庭用冷蔵庫/冷凍庫_JIS_C_9801",null,null,{"$f":"VLOOKUP(H369,試験規格マスタ!A:H,2,FALSE)","v":"JIS C_9801"},{"$f":"VLOOKUP(B369,試験規格マスタ!H:H,1,FALSE)","v":"JIS C 9801"}]
[366,"JIS B 8630",4,0,0,null,0,"環境_エネルギーラベル_家庭用冷蔵庫/冷凍庫_JIS_B_8630",null,null,{"$f":"VLOOKUP(H370,試験規格マスタ!A:H,2,FALSE)","v":"JIS B_8630"},{"$f":"VLOOKUP(B370,試験規格マスタ!H:H,1,FALSE)","v":"JIS B 8630"}]
[367,"記載のない試験規格をご希望の場合はここにご記入ください",3,0,2,null,0]
[368,"23．試験規格－製品安全（注：本項を申請する場合は、事前にVLACにご相談ください。）",1,0,0,null,0,"製品安全試験",null,null,{"$f":"VLOOKUP(H372,試験規格マスタ!A:H,2,FALSE)","v":"製品安全試験"},{"$f":"VLOOKUP(B372,試験規格マスタ!H:H,1,FALSE)","v":"23．試験規格－製品安全（注：本項を申請する場合は、事前にVLACにご相談ください。）"}]
[369,"IEC製品安全規格に基づく耐電圧試験及び漏れ電流測定",2,1,1,null,0,"製品安全試験_IEC",null,"Accessにあり。申請書になし。",{"$f":"VLOOKUP(H373,試験規格マスタ!A:H,2,FALSE)","v":"IEC製品安全規格に基づく耐電圧試験及び漏れ電流測定"},{"$f":"VLOOKUP(B373,試験規格マスタ!H:H,1,FALSE)","v":"IEC製品安全規格に基づく耐電圧試験及び漏れ電流測定"}]
[370,"家電製品",2,0,0,null,1,"製品安全試験_IEC_家電製品",null,null,{"$f":"VLOOKUP(H374,試験規格マスタ!A:H,2,FALSE)","v":"家電製品"},{"$f":"VLOOKUP(B374,試験規格マスタ!H:H,1,FALSE)","v":"家電製品"}]
[371,"IEC60335-1シリーズ",3,0,0,null,0,"製品安全試験_IEC_家電製品_IEC60335-1",null,null,{"$f":"VLOOKUP(H375,試験規格マスタ!A:H,2,FALSE)","v":"IEC60335-1"},{"$f":"VLOOKUP(B375,試験規格マスタ!H:H,1,FALSE)","v":"IEC60335-1シリーズ"}]
[372,"IEC60335-2シリーズ",3,0,0,null,0,"製品安全試験_IEC_家電製品_IEC60335-2",null,null,{"$f":"VLOOKUP(H376,試験規格マスタ!A:H,2,FALSE)","v":"IEC60335-2"},{"$f":"VLOOKUP(B376,試験規格マスタ!H:H,1,FALSE)","v":"IEC60335-2シリーズ"}]
[373,"EN 60335-1シリーズ",3,0,0,null,0,"製品安全試験_IEC_家電製品_EN60335-1",null,null,{"$f":"VLOOKUP(H377,試験規格マスタ!A:H,2,FALSE)","v":"EN 60335-1"},{"$f":"VLOOKUP(B377,試験規格マスタ!H:H,1,FALSE)","v":"EN 60335-1シリーズ"}]
[374,"EN 60335-2シリーズ",3,0,0,null,0,"製品安全試験_IEC_家電製品_EN60335-2",null,null,{"$f":"VLOOKUP(H378,試験規格マスタ!A:H,2,FALSE)","v":"EN 60335-2"},{"$f":"VLOOKUP(B378,試験規格マスタ!H:H,1,FALSE)","v":"EN 60335-2シリーズ"}]
[375,"JIS C 90335-1シリーズ",3,0,0,null,0,"製品安全試験_IEC_家電製品_JIS_C_90335-1",null,null,{"$f":"VLOOKUP(H379,試験規格マスタ!A:H,2,FALSE)","v":"JIS C_90335-1"},{"$f":"VLOOKUP(B379,試験規格マスタ!H:H,1,FALSE)","v":"JIS C 90335-1シリーズ"}]
[376,"JIS C 90335-2シリーズ",3,0,0,null,0,"製品安全試験_IEC_家電製品_JIS_C_90335-2",null,null,{"$f":"VLOOKUP(H380,試験規格マスタ!A:H,2,FALSE)","v":"JIS C_90335-2"},{"$f":"VLOOKUP(B380,試験規格マスタ!H:H,1,FALSE)","v":"JIS C 90335-2シリーズ"}]
[377,"記載のない試験規格をご希望の場合はここにご記入ください",3,0,3,null,0]
[378,"IT機器",2,0,0,null,1,"製品安全試験_IEC_IT機器",null,null,{"$f":"VLOOKUP(H382,試験規格マスタ!A:H,2,FALSE)","v":"IT機器"},{"$f":"VLOOKUP(B382,試験規格マスタ!H:H,1,FALSE)","v":"IT機器"}]
[379,"IEC 60950-1",3,0,0,null,0,"製品安全試験_IEC_IT機器_IEC60950-1",null,null,{"$f":"VLOOKUP(H383,試験規格マスタ!A:H,2,FALSE)","v":"IEC60950-1"},{"$f":"VLOOKUP(B383,試験規格マスタ!H:H,1,FALSE)","v":"IEC 60950-1"}]
[380,"EN 60950-1",3,0,0,null,0,"製品安全試験_IEC_IT機器_EN60950-1",null,null,{"$f":"VLOOKUP(H384,試験規格マスタ!A:H,2,FALSE)","v":"EN 60950-1"},{"$f":"VLOOKUP(B384,試験規格マスタ!H:H,1,FALSE)","v":"EN 60950-1"}]
[381,"JIS C60950-1",3,0,0,null,0,"製品安全試験_IEC_IT機器_JIS_C_60950-1",null,null,{"$f":"VLOOKUP(H385,試験規格マスタ!A:H,2,FALSE)","v":"JIS C_60950-1"},{"$f":"VLOOKUP(B385,試験規格マスタ!H:H,1,FALSE)","v":"JIS C60950-1"}]
[382,"記載のない試験規格をご希望の場合はここにご記入ください",3,0,3,null,0]
[383,"AV機器",2,0,0,null,1,"製品安全試験_IEC_AV機器",null,null,{"$f":"VLOOKUP(H387,試験規格マスタ!A:H,2,FALSE)","v":"AV機器"},{"$f":"VLOOKUP(B387,試験規格マスタ!H:H,1,FALSE)","v":"AV機器"}]
[384,"IEC 60065",3,0,0,null,0,"製品安全試験_IEC_AV機器_IEC60065",null,null,{"$f":"VLOOKUP(H388,試験規格マスタ!A:H,2,FALSE)","v":"IEC60065"},{"$f":"VLOOKUP(B388,試験規格マスタ!H:H,1,FALSE)","v":"IEC 60065"}]
[385,"EN 60065",3,0,0,null,0,"製品安全試験_IEC_AV機器_EN60065",null,null,{"$f":"VLOOKUP(H389,試験規格マスタ!A:H,2,FALSE)","v":"EN60065"},{"$f":"VLOOKUP(B389,試験規格マスタ!H:H,1,FALSE)","v":"EN 60065"}]
[386,"JIS C6065",3,0,0,null,0,"製品安全試験_IEC_AV機器_JIS_C_6065",null,null,{"$f":"VLOOKUP(H390,試験規格マスタ!A:H,2,FALSE)","v":"JIS C_6065"},{"$f":"VLOOKUP(B390,試験規格マスタ!H:H,1,FALSE)","v":"JIS C6065"}]
[387,"記載のない試験規格をご希望の場合はここにご記入ください",3,0,3,null,0]
[388,"医用電気機器",2,0,0,null,1,"製品安全試験_IEC_医用電気機器",null,null,{"$f":"VLOOKUP(H392,試験規格マスタ!A:H,2,FALSE)","v":"医用電気機器"},{"$f":"VLOOKUP(B392,試験規格マスタ!H:H,1,FALSE)","v":"医用電気機器"}]
[389,"IEC 60601-1",3,1,0,null,0,"製品安全試験_IEC_医用電気機器_IEC60601-1",null,"試験規格マスタおよびAccess画面より廃止済み",{"$f":"VLOOKUP(H393,試験規格マスタ!A:H,2,FALSE)","v":"IEC60601-1"},{"$f":"VLOOKUP(B393,試験規格マスタ!H:H,1,FALSE)","v":{"$error":"#N/A"}}]
[390,"IEC 60601-1シリーズ",3,0,0,null,0,"製品安全試験_IEC_医用電気機器_IEC60601-1",null,null,{"$f":"VLOOKUP(H394,試験規格マスタ!A:H,2,FALSE)","v":"IEC60601-1"},{"$f":"VLOOKUP(B394,試験規格マスタ!H:H,1,FALSE)","v":"IEC 60601-1シリーズ"}]
[391,"IEC 60601-2シリーズ",3,0,0,null,0,"製品安全試験_IEC_医用電気機器_IEC60601-2",null,null,{"$f":"VLOOKUP(H395,試験規格マスタ!A:H,2,FALSE)","v":"IEC60601-2"},{"$f":"VLOOKUP(B395,試験規格マスタ!H:H,1,FALSE)","v":"IEC 60601-2シリーズ"}]
[392,"EN60601-1",3,1,0,null,0,"製品安全試験_IEC_医用電気機器_EN60601-1",null,"試験規格マスタおよびAccess画面より廃止済み",{"$f":"VLOOKUP(H396,試験規格マスタ!A:H,2,FALSE)","v":"EN 60601-1"},{"$f":"VLOOKUP(B396,試験規格マスタ!H:H,1,FALSE)","v":{"$error":"#N/A"}}]
[393,"EN 60601-1シリーズ",3,0,0,null,0,"製品安全試験_IEC_医用電気機器_EN60601-1",null,null,{"$f":"VLOOKUP(H397,試験規格マスタ!A:H,2,FALSE)","v":"EN 60601-1"},{"$f":"VLOOKUP(B397,試験規格マスタ!H:H,1,FALSE)","v":"EN 60601-1シリーズ"}]
[394,"EN 60601-2シリーズ",3,0,0,null,0,"製品安全試験_IEC_医用電気機器_EN60601-2",null,null,{"$f":"VLOOKUP(H398,試験規格マスタ!A:H,2,FALSE)","v":"EN 60601-2"},{"$f":"VLOOKUP(B398,試験規格マスタ!H:H,1,FALSE)","v":"EN 60601-2シリーズ"}]
[395,"JIS T0601-1シリーズ",3,0,0,null,0,"製品安全試験_IEC_医用電気機器_JIS_T0601-1",null,null,{"$f":"VLOOKUP(H399,試験規格マスタ!A:H,2,FALSE)","v":"JIS T0601-1"},{"$f":"VLOOKUP(B399,試験規格マスタ!H:H,1,FALSE)","v":"JIS T0601-1シリーズ"}]
[396,"JIS_T0601-1-",3,1,0,null,0,"製品安全試験_IEC_医用電気機器_JIS_T0601-1-",null,"試験規格マスタおよびAccess画面より廃止済み",{"$f":"VLOOKUP(H400,試験規格マスタ!A:H,2,FALSE)","v":{"$error":"#N/A"}},{"$f":"VLOOKUP(B400,試験規格マスタ!H:H,1,FALSE)","v":{"$error":"#N/A"}}]
[397,"JIS T0601-2シリーズ",3,0,0,null,0,"製品安全試験_IEC_医用電気機器_JIS_T0601-2",null,null,{"$f":"VLOOKUP(H401,試験規格マスタ!A:H,2,FALSE)","v":"JIS T0601-2"},{"$f":"VLOOKUP(B401,試験規格マスタ!H:H,1,FALSE)","v":"JIS T0601-2シリーズ"}]
[398,"記載のない試験規格をご希望の場合はここにご記入ください",3,0,3,null,0]
[399,"制御機器・計測機器",2,0,0,null,1,"製品安全試験_IEC_制御機器計測機器",null,null,{"$f":"VLOOKUP(H403,試験規格マスタ!A:H,2,FALSE)","v":"制御機器・計測機器"},{"$f":"VLOOKUP(B403,試験規格マスタ!H:H,1,FALSE)","v":"制御機器・計測機器"}]
[400,"IEC 61010-1シリーズ",3,0,0,null,0,"製品安全試験_IEC_制御機器計測機器_IEC61010-1",null,null,{"$f":"VLOOKUP(H404,試験規格マスタ!A:H,2,FALSE)","v":"IEC61010-1"},{"$f":"VLOOKUP(B404,試験規格マスタ!H:H,1,FALSE)","v":"IEC 61010-1シリーズ"}]
[401,"IEC 61010-2シリーズ",3,0,0,null,0,"製品安全試験_IEC_制御機器計測機器_IEC61010-2",null,null,{"$f":"VLOOKUP(H405,試験規格マスタ!A:H,2,FALSE)","v":"IEC61010-2"},{"$f":"VLOOKUP(B405,試験規格マスタ!H:H,1,FALSE)","v":"IEC 61010-2シリーズ"}]
[402,"EN 61010-1シリーズ",3,0,0,null,0,"製品安全試験_IEC_制御機器計測機器_EN61010-1",null,null,{"$f":"VLOOKUP(H406,試験規格マスタ!A:H,2,FALSE)","v":"EN 61010-1"},{"$f":"VLOOKUP(B406,試験規格マスタ!H:H,1,FALSE)","v":"EN 61010-1シリーズ"}]
[403,"EN 61010-2シリーズ",3,0,0,null,0,"製品安全試験_IEC_制御機器計測機器_EN61010-2",null,null,{"$f":"VLOOKUP(H407,試験規格マスタ!A:H,2,FALSE)","v":"EN 61010-2"},{"$f":"VLOOKUP(B407,試験規格マスタ!H:H,1,FALSE)","v":"EN 61010-2シリーズ"}]
[404,"JIS C1010-1シリーズ",3,0,0,null,0,"製品安全試験_IEC_制御機器計測機器_JIS_C_1010-1",null,null,{"$f":"VLOOKUP(H408,試験規格マスタ!A:H,2,FALSE)","v":"JIS C_1010-1"},{"$f":"VLOOKUP(B408,試験規格マスタ!H:H,1,FALSE)","v":"JIS C1010-1シリーズ"}]
[405,"JIS C1010-2シリーズ",3,0,0,null,0,"製品安全試験_IEC_制御機器計測機器_JIS_C_1010-2",null,null,{"$f":"VLOOKUP(H409,試験規格マスタ!A:H,2,FALSE)","v":"JIS C_1010-2"},{"$f":"VLOOKUP(B409,試験規格マスタ!H:H,1,FALSE)","v":"JIS C1010-2シリーズ"}]
[406,"記載のない試験規格をご希望の場合はここにご記入ください",3,0,3,null,0]

{"sheet":"事務局用メニュー","index":18,"n_rows":2,"n_cols":2,"rows_kept":2,"hidden":true}
[]
[null,"事務局用メニュー"]

{"sheet":"【テンプレート】新規格入力","index":19,"n_rows":33,"n_cols":26,"rows_kept":33,"hidden":true,"merged":[[3,1,3,11],[3,12,3,13],[3,14,3,24],[3,25,3,26],[4,1,4,11],[4,12,4,13],[4,14,4,24],[4,25,4,26],[5,1,5,11],[5,12,5,13],[5,14,5,24],[5,25,5,26],[6,1,6,11],[6,12,6,13],[6,14,6,24],[6,25,6,26],[7,1,7,11],[7,12,7,13],[7,14,7,24],[7,25,7,26],[8,1,8,11],[8,12,8,13],[8,14,8,24],[8,25,8,26],[9,1,9,11],[9,12,9,13],[9,14,9,24],[9,25,9,26],[10,1,10,11],[10,12,10,13],[10,14,10,24],[10,25,10,26],[11,1,11,11],[11,12,11,13],[11,14,11,24],[11,25,11,26],[12,1,12,11],[12,12,12,13],[12,14,12,24],[12,25,12,26],[13,1,13,11],[13,12,13,13],[13,14,13,24],[13,25,13,26],[21,1,21,11],[21,12,21,13],[21,14,21,24],[21,25,21,26],[22,1,22,11],[22,12,22,13],[22,14,22,24],[22,25,22,26],[23,1,23,11],[23,12,23,13],[23,14,23,24],[23,25,23,26],[24,1,24,11],[24,12,24,13],[24,14,24,24],[24,25,24,26],[25,1,25,11],[25,12,25,13],[25,14,25,24],[25,25,25,26],[26,1,26,11],[26,12,26,13],[26,14,26,24],[26,25,26,26],[27,1,27,11],[27,12,27,13],[27,14,27,24],[27,25,27,26],[28,1,28,11],[28,12,28,13],[28,14,28,24],[28,25,28,26],[29,1,29,11],[29,12,29,13],[29,14,29,24],[29,25,29,26],[30,1,30,11],[30,12,30,13],[30,14,30,24],[30,25,30,26],[31,1,31,11],[31,12,31,13],[31,14,31,24],[31,25,31,26]]}
[]
[null,"記載のない試験規格をご希望の場合はここにご記入ください"]
[null,"注：下記に記載の規格番号及び表記が認定証に記載されます"]
[null,"日本語規格番号",{"$nulls":10},"通則版",null,"英語規格番号",{"$nulls":10},"通則版"]
{"$rows_empty":10}
[null,"行追加"]
[]
[]
[]
[]
[null,"記載のない試験規格をご希望の場合はここにご記入ください"]
[null,"注：下記に記載の規格番号及び表記が認定証に記載されます"]
[null,"日本語規格番号",{"$nulls":10},"通則版",null,"英語規格番号",{"$nulls":10},"通則版"]
{"$rows_empty":10}
[null,"行追加"]