{"text_format":"3","workbook":"xlsx","n_sheets":20,"sheets":["エラー表示","添付資料","表紙","基本情報入力","英文名称入力","試験区分入力","試験規格入力","認定試験実施設備入力","AccessImport_0","AccessImport_1","AccessImport_2","AccessImport","試験項目マスタ","試験区分マスタ","試験規格マスタ","設定_試験項目","設定_試験区分","設定_試験規格","事務局用メニュー","【テンプレート】新規格入力"],"not_rendered":{"images":9,"macros":1,"external_links":1,"defined_names":107,"comments":3},"read":"whole","date_system":"1900"}

{"sheet":"エラー表示","index":0,"n_rows":1,"n_cols":1,"rows_kept":1}
["エラー表示"]

{"sheet":"添付資料","index":1,"n_rows":61,"n_cols":4,"rows_kept":61}
["添付資料"]
[null,"・","下記書類の他に試験区分に関する資料も必要です。試験区分シートを参照してください。"]
[null,"・","認定申請書、添付資料および付属文書は正・副（正本１通、副本２通、計３通、またはVLAC指示による通数）をCDやDVDに記録して提出して下さい。"]
[null,"・","電子ファイルのファイル名には下線の名を付して記録して下さい。"]
[]
[null,"新規認定・認定更新・認定拡大・認定変更"]
[null,"・","認定拡大･変更審査の場合、②の資料は不要です。"]
[null,"・","③～⑮は拡大・変更に関連する資料を提出して下さい。"]
[null,"・","⑭は新規認定の申請時に準備できない場合には、現地審査時までに実施しその記録を保持してください。"]
[null,null,"①　認定申請書　（VLAC-VF100）"]
{"$rows_left_out":52}
{"sheet":"表紙","index":2,"n_rows":110,"n_cols":33,"rows_kept":110,"merged":[[1,22,1,25],[1,27,1,28],[1,30,1,31],[6,30,7,37],[10,8,10,14],[10,15,10,18],[10,19,10,26],[12,8,12,14],[12,15,12,18],[12,19,12,26],[14,8,14,14],[14,15,14,18],[14,19,14,26],[16,8,16,14],[16,15,16,18],[16,19,16,29],[18,8,18,14],[18,15,18,18],[18,19,18,29],[24,10,24,32],[26,11,26,12],[26,14,26,16],[26,18,26,32],[28,10,28,32],[30,10,30,32],[32,11,32,12],[32,14,32,16],[32,18,32,32],[34,10,34,32],[36,10,36,32],[38,10,38,32],[40,10,40,32],[42,10,42,32],[50,4,50,23],[50,26,50,28],[53,4,53,5],[53,7,53,9],[55,4,55,29],[58,4,58,23],[58,26,58,28],[61,4,61,5],[61,7,61,9],[63,4,63,29],[66,4,66,23],[66,26,66,28],[69,4,69,5],[69,7,69,9],[71,4,71,29],[74,4,74,23],[74,26,74,28],[77,4,77,5],[77,7,77,9],[79,4,79,29],[82,4,82,23],[82,26,82,28],[85,4,85,5],[85,7,85,9],[87,4,87,29],[90,4,90,23],[90,26,90,28],[93,4,93,5],[93,7,93,9],[95,4,95,29],[98,4,98,23],[98,26,98,28],[101,4,101,5],[101,7,101,9],[103,4,103,29],[106,4,106,23],[106,26,106,28],[109,4,109,5],[109,7,109,9],[111,4,111,29]]}
["VLAC-VF100:2017(R11)"]
["発行年月日：2017年1月6日",{"$nulls":20},"西暦",{"$nulls":4},"年",null,null,"月",null,null,"日"]
[]
[null,"株式会社　電磁環境試験所認定センター　殿"]
["試験所認定・サーベイランス審査申請"]
["新規認定・認定更新・認定拡大・認定変更申請書"]
["初回サーベイランス・サーベイランス申請書",{"$nulls":29},"未チェック"]
[]
[null,null,"（申請種別）",{"$nulls":5},"新規認定審査"]
[]
{"$rows_left_out":101}
{"sheet":"基本情報入力","index":3,"n_rows":70,"n_cols":58,"rows_kept":70,"merged":[[2,2,2,21],[2,24,2,26],[5,2,5,3],[5,5,5,7],[6,2,6,27],[64,1,69,3],[64,4,65,8],[64,9,65,12],[64,13,65,15],[64,16,65,18],[64,19,65,21],[64,22,65,24],[64,25,65,29],[64,30,65,34],[66,4,68,8],[66,9,68,12],[66,13,68,15],[66,16,68,18],[66,19,68,21],[66,22,68,24],[66,25,68,29],[66,30,68,34],[69,4,69,7],[69,14,69,17],[69,22,69,25]]}
[null,"2．試験場名称"]
[{"$nulls":23},"枝番号"]
[{"$nulls":23},"（",{"$nulls":3},"）"]
[]
[null,"住所"]
[null,"〒",null,null,"－"]
[]
[]
[]
[null,"3．申請試験項目（申請する試験項目にチェックしてください。）",{"$nulls":50},"項番","階層","表示タイプ","チェック内容","枝番設定","試験項目コード"]
{"$rows_left_out":61}
{"sheet":"英文名称入力","index":4,"n_rows":25,"n_cols":2,"rows_kept":25}
[]
[null,"英文ホームページ情報（入力必須）"]
[]
[null,"英文試験所名称"]
[]
[]
[null,"英文試験所所在地"]
[]
[]
[null,"英文試験場名称"]
{"$rows_left_out":16}
{"sheet":"試験区分入力","index":5,"n_rows":194,"n_cols":60,"rows_kept":194,"merged":[[1,0,1,17],[1,18,1,26],[1,27,1,34],[1,35,1,41],[1,42,1,44],[2,0,3,17],[2,18,2,19],[2,20,2,26],[2,27,3,34],[2,35,3,41],[2,42,3,44],[3,18,3,19],[3,20,3,26],[11,14,11,16],[13,12,13,14],[13,17,13,19],[16,14,16,16],[18,12,18,16],[18,18,18,22],[60,21,60,25],[60,27,60,31],[61,22,61,26],[61,28,61,32],[62,16,62,20],[62,22,62,26],[64,22,64,26],[64,28,64,32],[65,16,65,20],[65,22,65,26],[66,15,66,19],[66,21,66,25],[68,22,68,26],[68,28,68,32],[82,24,82,28],[82,30,82,34],[83,26,83,30],[83,32,83,36],[84,16,84,20],[84,22,84,26],[85,16,85,20],[85,22,85,26]]}
["複数の試験場がある場合はこのファイルを試験場毎に作成してください。"]
["試験場名称",{"$nulls":17},"試験場管理責任者名/所属",{"$nulls":8},"E-mail",{"$nulls":7},"電話番号",{"$nulls":6},"事務局記入"]
[{"$f":"基本情報入力!C3","v":0},{"$nulls":17},"名前"]
[{"$nulls":18},"所属"]
[null,"注１：下記に記載された試験区分の中で認定の対象となる区分を全てチェックしてください。",{"$nulls":54},"不使用カラム"]
[null,"注２：カッコ内に記載されている付属書が要求されている試験区分については、試験を実施する設備毎に該当する付属書。",{"$nulls":50},"項番","階層","表示タイプ",null,"枝番設定","試験区分コード","測定周波数範囲最小","測定周波数範囲最大"]
[null,null,"5．試験区分－電磁両立性 エミッション",{"$nulls":49},1,1,0,false,null,"エミ"]
[{"$nulls":3},"5.1．放射妨害波 （エンクロージャーポート）",{"$nulls":48},2,2,0,false,null,"エミ_放射_エンク"]
[{"$nulls":4},"放射妨害波電界強度試験",{"$nulls":47},3,3,0,null,null,"エミ_放射_エンク_妨害電界"]
[{"$nulls":5},"基準大地面上（付属書：VF102またはVF103）",{"$nulls":46},4,4,0,null,null,"エミ_放射_エンク_妨害電界_基準"]
{"$rows_left_out":185}
{"sheet":"試験規格入力","index":6,"n_rows":577,"n_cols":63,"rows_kept":577,"merged":[[1,0,1,17],[1,18,1,26],[1,27,1,34],[1,35,1,41],[1,42,1,44],[2,0,3,17],[2,18,2,19],[2,20,2,26],[2,27,3,34],[2,35,3,41],[2,42,2,44],[3,18,3,19],[3,20,3,26],[3,42,3,44],[111,2,111,12],[111,13,111,14],[111,15,111,25],[111,26,111,27],[112,2,112,12],[112,13,112,14],[112,15,112,25],[112,26,112,27],[113,2,113,12],[113,13,113,14],[113,15,113,25],[113,26,113,27],[114,2,114,12],[114,13,114,14],[114,15,114,25],[114,26,114,27],[115,2,115,12],[115,13,115,14],[115,15,115,25],[115,26,115,27],[116,2,116,12],[116,13,116,14],[116,15,116,25],[116,26,116,27],[117,2,117,12],[117,13,117,14],[117,15,117,25],[117,26,117,27],[118,2,118,12],[118,13,118,14],[118,15,118,25],[118,26,118,27],[119,2,119,12],[119,13,119,14],[119,15,119,25],[119,26,119,27],[120,2,120,12],[120,13,120,14],[120,15,120,25],[120,26,120,27],[121,2,121,12],[121,13,121,14],[121,15,121,25],[121,26,121,27],[177,2,177,12],[177,13,177,14],[177,15,177,25],[177,26,177,27],[178,2,178,12],[178,13,178,14],[178,15,178,25],[178,26,178,27],[179,2,179,12],[179,13,179,14],[179,15,179,25],[179,26,179,27],[180,2,180,12],[180,13,180,14],[180,15,180,25],[180,26,180,27],[181,2,181,12],[181,13,181,14],[181,15,181,25],[181,26,181,27],[182,2,182,12],[182,13,182,14],[182,15,182,25],[182,26,182,27],[183,2,183,12],[183,13,183,14],[183,15,183,25],[183,26,183,27],[184,2,184,12],[184,13,184,14],[184,15,184,25],[184,26,184,27],[185,2,185,12],[185,13,185,14],[185,15,185,25],[185,26,185,27],[186,2,186,12],[186,13,186,14],[186,15,186,25],[186,26,186,27],[187,2,187,12],[187,13,187,14],[187,15,187,25],[187,26,187,27],[222,2,222,12],[222,13,222,14],[222,15,222,25],[222,26,222,27],[223,2,223,12],[223,13,223,14],[223,15,223,25],[223,26,223,27],[224,2,224,12],[224,13,224,14],[224,15,224,25],[224,26,224,27],[225,2,225,12],[225,13,225,14],[225,15,225,25],[225,26,225,27],[226,2,226,12],[226,13,226,14],[226,15,226,25],[226,26,226,27],[227,2,227,12],[227,13,227,14],[227,15,227,25],[227,26,227,27],[228,2,228,12],[228,13,228,14],[228,15,228,25],[228,26,228,27],[229,2,229,12],[229,13,229,14],[229,15,229,25],[229,26,229,27],[230,2,230,12],[230,13,230,14],[230,15,230,25],[230,26,230,27],[231,2,231,12],[231,13,231,14],[231,15,231,25],[231,26,231,27],[232,2,232,12],[232,13,232,14],[232,15,232,25],[232,26,232,27],[241,2,241,12],[241,13,241,14],[241,15,241,25],[241,26,241,27],[242,2,242,12],[242,13,242,14],[242,15,242,25],[242,26,242,27],[243,2,243,12],[243,13,243,14],[243,15,243,25],[243,26,243,27],[244,2,244,12],[244,13,244,14],[244,15,244,25],[244,26,244,27],[245,2,245,12],[245,13,245,14],[245,15,245,25],[245,26,245,27],[246,2,246,12],[246,13,246,14],[246,15,246,25],[246,26,246,27],[247,2,247,12],[247,13,247,14],[247,15,247,25],[247,26,247,27],[248,2,248,12],[248,13,248,14],[248,15,248,25],[248,26,248,27],[249,2,249,12],[249,13,249,14],[249,15,249,25],[249,26,249,27],[250,2,250,12],[250,13,250,14],[250,15,250,25],[250,26,250,27],[251,2,251,12],[251,13,251,14],[251,15,251,25],[251,26,251,27],[270,2,270,12],[270,13,270,14],[270,15,270,25],[270,26,270,27],[271,2,271,12],[271,13,271,14],[271,15,271,25],[271,26,271,27],[272,2,272,12],[272,13,272,14],[272,15,272,25],[272,26,272,27],[273,2,273,12],[273,13,273,14],[273,15,273,25],[273,26,273,27],[274,2,274,12],[274,13,274,14],[274,15,274,25],[274,26,274,27],[275,2,275,12],[275,13,275,14],[275,15,275,25],[275,26,275,27],[276,2,276,12],[276,13,276,14],[276,15,276,25],[276,26,276,27],[277,2,277,12],[277,13,277,14],[277,15,277,25],[277,26,277,27],[278,2,278,12],[278,13,278,14],[278,15,278,25],[278,26,278,27],[279,2,279,12],[279,13,279,14],[279,15,279,25],[279,26,279,27],[280,2,280,12],[280,13,280,14],[280,15,280,25],[280,26,280,27],[324,9,324,10],[324,12,324,13],[324,15,324,16],[324,18,324,19],[324,21,324,22],[324,24,324,25],[324,27,324,28],[343,2,343,12],[343,13,343,14],[343,15,343,25],[343,26,343,27],[344,2,344,12],[344,13,344,14],[344,15,344,25],[344,26,344,27],[345,2,345,12],[345,13,345,14],[345,15,345,25],[345,26,345,27],[346,2,346,12],[346,13,346,14],[346,15,346,25],[346,26,346,27],[347,2,347,12],[347,13,347,14],[347,15,347,25],[347,26,347,27],[348,2,348,12],[348,13,348,14],[348,15,348,25],[348,26,348,27],[349,2,349,12],[349,13,349,14],[349,15,349,25],[349,26,349,27],[350,2,350,12],[350,13,350,14],[350,15,350,25],[350,26,350,27],[351,2,351,12],[351,13,351,14],[351,15,351,25],[351,26,351,27],[352,2,352,12],[352,13,352,14],[352,15,352,25],[352,26,352,27],[353,2,353,12],[353,13,353,14],[353,15,353,25],[353,26,353,27],[383,2,383,12],[383,13,383,14],[383,15,383,25],[383,26,383,27],[384,2,384,12],[384,13,384,14],[384,15,384,25],[384,26,384,27],[385,2,385,12],[385,13,385,14],[385,15,385,25],[385,26,385,27],[386,2,386,12],[386,13,386,14],[386,15,386,25],[386,26,386,27],[387,2,387,12],[387,13,387,14],[387,15,387,25],[387,26,387,27],[388,2,388,12],[388,13,388,14],[388,15,388,25],[388,26,388,27],[389,2,389,12],[389,13,389,14],[389,15,389,25],[389,26,389,27],[390,2,390,12],[390,13,390,14],[390,15,390,25],[390,26,390,27],[391,2,391,12],[391,13,391,14],[391,15,391,25],[391,26,391,27],[392,2,392,12],[392,13,392,14],[392,15,392,25],[392,26,392,27],[393,2,393,12],[393,13,393,14],[393,15,393,25],[393,26,393,27],[401,2,401,12],[401,13,401,14],[401,15,401,25],[401,26,401,27],[402,2,402,12],[402,13,402,14],[402,15,402,25],[402,26,402,27],[403,2,403,12],[403,13,403,14],[403,15,403,25],[403,26,403,27],[404,2,404,12],[404,13,404,14],[404,15,404,25],[404,26,404,27],[405,2,405,12],[405,13,405,14],[405,15,405,25],[405,26,405,27],[406,2,406,12],[406,13,406,14],[406,15,406,25],[406,26,406,27],[407,2,407,12],[407,13,407,14],[407,15,407,25],[407,26,407,27],[408,2,408,12],[408,13,408,14],[408,15,408,25],[408,26,408,27],[409,2,409,12],[409,13,409,14],[409,15,409,25],[409,26,409,27],[410,2,410,12],[410,13,410,14],[410,15,410,25],[410,26,410,27],[411,2,411,12],[411,13,411,14],[411,15,411,25],[411,26,411,27],[465,3,465,13],[465,14,465,15],[465,16,465,26],[465,27,465,28],[466,3,466,13],[466,14,466,15],[466,16,466,26],[466,27,466,28],[467,3,467,13],[467,14,467,15],[467,16,467,26],[467,27,467,28],[468,3,468,13],[468,14,468,15],[468,16,468,26],[468,27,468,28],[469,3,469,13],[469,14,469,15],[469,16,469,26],[469,27,469,28],[470,3,470,13],[470,14,470,15],[470,16,470,26],[470,27,470,28],[471,3,471,13],[471,14,471,15],[471,16,471,26],[471,27,471,28],[472,3,472,13],[472,14,472,15],[472,16,472,26],[472,27,472,28],[473,3,473,13],[473,14,473,15],[473,16,473,26],[473,27,473,28],[474,3,474,13],[474,14,474,15],[474,16,474,26],[474,27,474,28],[475,3,475,13],[475,14,475,15],[475,16,475,26],[475,27,475,28],[487,3,487,13],[487,14,487,15],[487,16,487,26],[487,27,487,28],[488,3,488,13],[488,14,488,15],[488,16,488,26],[488,27,488,28],[489,3,489,13],[489,14,489,15],[489,16,489,26],[489,27,489,28],[490,3,490,13],[490,14,490,15],[490,16,490,26],[490,27,490,28],[491,3,491,13],[491,14,491,15],[491,16,491,26],[491,27,491,28],[492,3,492,13],[492,14,492,15],[492,16,492,26],[492,27,492,28],[493,3,493,13],[493,14,493,15],[493,16,493,26],[493,27,493,28],[494,3,494,13],[494,14,494,15],[494,16,494,26],[494,27,494,28],[495,3,495,13],[495,14,495,15],[495,16,495,26],[495,27,495,28],[496,3,496,13],[496,14,496,15],[496,16,496,26],[496,27,496,28],[497,3,497,13],[497,14,497,15],[497,16,497,26],[497,27,497,28],[505,3,505,13],[505,14,505,15],[505,16,505,26],[505,27,505,28],[506,3,506,13],[506,14,506,15],[506,16,506,26],[506,27,506,28],[507,3,507,13],[507,14,507,15],[507,16,507,26],[507,27,507,28],[508,3,508,13],[508,14,508,15],[508,16,508,26],[508,27,508,28],[509,3,509,13],[509,14,509,15],[509,16,509,26],[509,27,509,28],[510,3,510,13],[510,14,510,15],[510,16,510,26],[510,27,510,28],[511,3,511,13],[511,14,511,15],[511,16,511,26],[511,27,511,28],[512,3,512,13],[512,14,512,15],[512,16,512,26],[512,27,512,28],[513,3,513,13],[513,14,513,15],[513,16,513,26],[513,27,513,28],[514,3,514,13],[514,14,514,15],[514,16,514,26],[514,27,514,28],[515,3,515,13],[515,14,515,15],[515,16,515,26],[515,27,515,28],[523,3,523,13],[523,14,523,15],[523,16,523,26],[523,27,523,28],[524,3,524,13],[524,14,524,15],[524,16,524,26],[524,27,524,28],[525,3,525,13],[525,14,525,15],[525,16,525,26],[525,27,525,28],[526,3,526,13],[526,14,526,15],[526,16,526,26],[526,27,526,28],[527,3,527,13],[527,14,527,15],[527,16,527,26],[527,27,527,28],[528,3,528,13],[528,14,528,15],[528,16,528,26],[528,27,528,28],[529,3,529,13],[529,14,529,15],[529,16,529,26],[529,27,529,28],[530,3,530,13],[530,14,530,15],[530,16,530,26],[530,27,530,28],[531,3,531,13],[531,14,531,15],[531,16,531,26],[531,27,531,28],[532,3,532,13],[532,14,532,15],[532,16,532,26],[532,27,532,28],[533,3,533,13],[533,14,533,15],[533,16,533,26],[533,27,533,28],[544,3,544,13],[544,14,544,15],[544,16,544,26],[544,27,544,28],[545,3,545,13],[545,14,545,15],[545,16,545,26],[545,27,545,28],[546,3,546,13],[546,14,546,15],[546,16,546,26],[546,27,546,28],[547,3,547,13],[547,14,547,15],[547,16,547,26],[547,27,547,28],[548,3,548,13],[548,14,548,15],[548,16,548,26],[548,27,548,28],[549,3,549,13],[549,14,549,15],[549,16,549,26],[549,27,549,28],[550,3,550,13],[550,14,550,15],[550,16,550,26],[550,27,550,28],[551,3,551,13],[551,14,551,15],[551,16,551,26],[551,27,551,28],[552,3,552,13],[552,14,552,15],[552,16,552,26],[552,27,552,28],[553,3,553,13],[553,14,553,15],[553,16,553,26],[553,27,553,28],[554,3,554,13],[554,14,554,15],[554,16,554,26],[554,27,554,28],[565,3,565,13],[565,14,565,15],[565,16,565,26],[565,27,565,28],[566,3,566,13],[566,14,566,15],[566,16,566,26],[566,27,566,28],[567,3,567,13],[567,14,567,15],[567,16,567,26],[567,27,567,28],[568,3,568,13],[568,14,568,15],[568,16,568,26],[568,27,568,28],[569,3,569,13],[569,14,569,15],[569,16,569,26],[569,27,569,28],[570,3,570,13],[570,14,570,15],[570,16,570,26],[570,27,570,28],[571,3,571,13],[571,14,571,15],[571,16,571,26],[571,27,571,28],[572,3,572,13],[572,14,572,15],[572,16,572,26],[572,27,572,28],[573,3,573,13],[573,14,573,15],[573,16,573,26],[573,27,573,28],[574,3,574,13],[574,14,574,15],[574,16,574,26],[574,27,574,28],[575,3,575,13],[575,14,575,15],[575,16,575,26],[575,27,575,28]]}
["複数の試験場がある場合はこのファイルを試験場毎に作成してください。"]
["試験場名称",{"$nulls":17},"試験場管理責任者名/所属",{"$nulls":8},"E-mail",{"$nulls":7},"電話番号",{"$nulls":6},"事務局記入"]
[{"$f":"IF(試験区分入力!A3=0,\"\",試験区分入力!A3)","v":""},{"$nulls":17},"名前",null,{"$f":"IF(試験区分入力!U3=0,\"\",試験区分入力!U3)","v":""},{"$nulls":6},{"$f":"IF(試験区分入力!AB3=0,\"\",試験区分入力!AB3)","v":""},{"$nulls":7},{"$f":"IF(試験区分入力!AJ3=0,\"\",試験区分入力!AJ3)","v":""}]
[{"$nulls":18},"所属",null,{"$f":"IF(試験区分入力!U4=0,\"\",試験区分入力!U4)","v":""}]
[null,"注１：下記に記載された試験区分の中で認定の対象となる規格を全てチェックしてください。",{"$nulls":50},"項番","階層","表示タイプ","チェック内容","枝番設定","試験規格コード","(新規格用)試験規格名称","(新規格用)試験規格名称英語","(新規格用)親試験規格名称","枝番内容","下位試験規格コード"]
[null,null,"14．試験規格－電磁両立性エミッション",{"$nulls":49},1,1,0,null,null,"エミッション"]
[{"$nulls":3},"VCCI技術基準 V-3",{"$nulls":48},2,2,0,null,null,"エミッション_VCCI技術基準V-3"]
[{"$nulls":3},"FCC Part15B　この項にチェックする場合は、申請書の【英文名称入力】シートを入力して下さい。",{"$nulls":48},3,2,0,null,null,"エミッション_FCC_Part15B"]
[{"$nulls":4},"Subpart B ITE等、非意図放射機器試験",{"$nulls":47},4,3,0,null,null,"エミッション_FCC_Part15B_SubB_情報処理装置等"]
[{"$nulls":5},"ANSI C63.4:2003",{"$nulls":46},5,4,0,null,null,"エミッション_FCC_Part15B_SubB_情報処理装置等_ANSI_63_4_2003"]
{"$rows_left_out":568}
{"sheet":"認定試験実施設備入力","index":7,"n_rows":35,"n_cols":12,"rows_kept":35,"merged":[[2,0,2,6],[3,3,4,3],[3,4,4,6],[5,3,6,3],[5,4,6,6],[7,3,8,3],[7,4,8,6],[13,0,18,0],[19,0,25,0],[26,0,27,0]]}
["VLAC-VF100:2017(R11)"]
["発行年月日：2017年1月6日"]
["VLAC認定試験を実施する設備"]
["参考資料",null,null,"試験所："]
["VLAC-VF100:2016(R10)　試験所認定申請書"]
[{"$nulls":3},"試験場："]
["この表は試験場毎に作成して下さい。"]
[{"$nulls":3},"住所："]
[]
[]
{"$rows_left_out":26}
{"sheet":"AccessImport_0","index":8,"n_rows":82,"n_cols":4,"rows_kept":82,"hidden":true}
["シート名","項目","値_1","値_2"]
["表紙","申請日",{"$f":"表紙!W2&\"/\"&表紙!AB2&\"/\"&表紙!AE2","v":"//"},"-"]
["表紙","申請種別_新規",false,"-"]
["表紙","申請種別_更新",false,{"$f":"表紙!P11","v":0}]
["表紙","申請種別_拡大",false,{"$f":"表紙!P13","v":0}]
["表紙","申請種別_変更",false,{"$f":"表紙!P15","v":0}]
["表紙","申請種別_初サーベイランス",false,{"$f":"表紙!P17","v":0}]
["表紙","申請種別_サーベイランス",false,{"$f":"表紙!P19","v":0}]
["表紙","試験所名称",{"$f":"表紙!K25","v":0},"-"]
["表紙","試験所所在地",{"$f":"表紙!S27","v":0},"-"]
{"$rows_left_out":73}
{"sheet":"AccessImport_1","index":9,"n_rows":1,"n_cols":3,"rows_kept":1,"hidden":true}
["項番","階層","試験項目コード"]

{"sheet":"AccessImport_2","index":10,"n_rows":1,"n_cols":5,"rows_kept":1,"hidden":true}
["項番","階層","試験区分コード","測定周波数範囲最小","測定周波数範囲最大"]

{"sheet":"AccessImport","index":11,"n_rows":1,"n_cols":9,"rows_kept":1,"hidden":true}
["項番","階層","試験規格コード","日本語文言","英語文言","親試験規格","枝番","新規格フラグ","下位試験規格コード"]

{"sheet":"試験項目マスタ","index":12,"n_rows":77,"n_cols":8,"rows_kept":77,"hidden":true}
["試験項目コード","試験項目名称","試験項目名称英語","価格項目","表示順","申請書名称","階層","備考"]
["項目_エミ","エミッション","Emission","基本技術審査料金",1,"エミッション",1,""]
["項目_エミ_放射妨害波","放射妨害波","","追加技術審査料金０",2,"放射妨害波（FCC、CISPR11関連規格の1GHz超試験を含む）",2,""]
["項目_エミ_伝導妨害波","伝導妨害波","","追加技術審査料金０",3,"伝導妨害波",2,""]
["項目_イミ","イミュニティ","","基本技術審査料金",4,"イミュニティ",1,""]
["項目_イミ_静電気","静電気","","追加技術審査料金０",5,"静電気",2,""]
["項目_イミ_放射電磁界","放射電磁界","","追加技術審査料金０",6,"放射電磁界",2,""]
["項目_イミ_放射磁界","放射磁界","","追加技術審査料金０",7,"放射磁界",2,""]
["項目_イミ_電気的過渡バースト","電気的過渡バースト","","追加技術審査料金０",8,"電気的過度バースト",2,""]
["項目_イミ_サージ","サージ","","追加技術審査料金０",9,"サージ",2,""]
{"$rows_left_out":68}
{"sheet":"試験区分マスタ","index":13,"n_rows":206,"n_cols":9,"rows_kept":206,"hidden":true}
["試験区分コード","試験区分名称","試験区分名称英語","文書様式","親試験区分コード","階層","表示順","備考","申請書名称"]
["エミ","エミッション","Emission test","","試験区分",1,1,"","5．試験区分－電磁両立性 エミッション"]
["エミ_放射_エンク","放射妨害波_エンクロージャーポート","Radiated disturbance : Enclosure Port","","エミ",2,2,"","5.1．放射妨害波 （エンクロージャーポート）"]
["エミ_放射_エンク_妨害電界","妨害電界強度試験 (CISPR 16-2-3, ANSI C63.4:2003/2009)","Disturbance electric field test","","エミ_放射_エンク",3,3,"","放射妨害波電界強度試験"]
["エミ_放射_エンク_妨害電界_基準","[試験条件]基準大地面上","On the reference ground plane","","エミ_放射_エンク_妨害電界",4,4,"","基準大地面上（付属書：VF102またはVF103）"]
["エミ_放射_エンク_妨害電界_基準_測定周波数範囲","測定周波数範囲：30MHz～$MAXGHz","Measurement Frequency Range : 30MHz～$MAXGHz","","エミ_放射_エンク_妨害電界_基準",5,5,"","測定周波数範囲"]
["エミ_放射_エンク_妨害電界_基準_車載機器","基準大地面上：車載機器試験（1m法）","On the reference ground plane: In-vehicle equipment test(1m Method)","","エミ_放射_エンク_妨害電界_基準",5,6,"","基準大地面上：車載機器試験(1m法)（付属書：VF170）"]
["エミ_放射_エンク_妨害電界_基準_車載機器_測定周波数範囲","測定周波数範囲：$MINkHz～$MAXGHz","Measurement Frequency Range :  $MINkHz～$MAXGHz","","エミ_放射_エンク_妨害電界_基準_車載機器",6,7,"","測定周波数範囲"]
["エミ_放射_エンク_妨害電界_準自由_VF152","[試験条件]準自由空間","Qasi free space","","エミ_放射_エンク_妨害電界",4,8,"","準自由空間（付属書：VF-152）"]
["エミ_放射_エンク_妨害電界_準自由_VF152_1GHz","測定周波数範囲：1GHｚ～$MAXGHz","Measurement Frequency Range : 1GHｚ～$MAXGHz","","エミ_放射_エンク_妨害電界_準自由_VF152",5,9,"","測定周波数範囲"]
{"$rows_left_out":197}
{"sheet":"試験規格マスタ","index":14,"n_rows":515,"n_cols":8,"rows_kept":515,"hidden":true}
["試験規格コード","試験規格名称","試験規格名称英語","親試験規格コード","階層","表示順","備考","申請書名称"]
["エミッション","エミッション試験","Emission test","試験規格",1,1,null,"14．試験規格－電磁両立性エミッション"]
["エミッション_VCCI技術基準V-3","VCCI技術基準V-3","V-3：VCCI Technical Requirement","エミッション",2,2,null,"VCCI技術基準 V-3"]
["エミッション_FCC_Part15B","FCC Part15B","FCC Part15B","エミッション",2,3,null,"FCC Part15B　この項にチェックする場合は、申請書の【英文名称入力】シートを入力して下さい。"]
["エミッション_FCC_Part15B_SubB_情報処理装置等","Subpart B 情報処理装置等、非意図放射機器試験","Subpart B Unintentional radiators","エミッション_FCC_Part15B",3,4,null,"Subpart B ITE等、非意図放射機器試験"]
["エミッション_FCC_Part15B_SubB_情報処理装置等_ANSI_63_4_2003","ANSI C63.4:2003","ANSI C63.4:2003","エミッション_FCC_Part15B",3,5,null,"ANSI C63.4-2003"]
["エミッション_FCC_Part15B_SubB_情報処理装置等_ANSI_63_4_2009","ANSI C63.4:2009","ANSI C63.4:2009","エミッション_FCC_Part15B",3,6,null,"ANSI C63.4-2009"]
["エミッション_FCC_Part15B_SubB_情報処理装置等_ANSI_63_4_2014","ANSI C63.4:2014","ANSI C63.4:2014","エミッション_FCC_Part15B",3,7,null,"ANSI C63.4-2014"]
["エミッション_FCC_Part15B_SubB_放送受信機試験","Subpart B 放送受信機試験","Subpart B Broadcast receiver","エミッション_FCC_Part15B",3,8,null,"Subpart B放送受信機試験"]
["エミッション_FCC_Part15B_SubB_放送受信機試験_放送受信","放送受信(MP-2を含む)","Broadcast receivers, including MP-2","エミッション_FCC_Part15B",3,9,null,"ANSI C63.4に基づく放送受信(MP-2を含む)"]
{"$rows_left_out":506}
{"sheet":"設定_試験項目","index":15,"n_rows":55,"n_cols":10,"rows_kept":55,"hidden":true}
[]
[]
[]
["項番","タイトル","階層","表示非表示","表示タイプ","枝番入力","親試験項目フラグ","試験項目コード","表示順","備考"]
[1,"エミッション",1,0,0,null,1,"項目_エミ",1]
[2,"放射妨害波（FCC、CISPR11関連規格の1GHz超試験を含む）",2,0,0,null,0,"項目_エミ_放射妨害波",2]
[3,"伝導妨害波",2,0,0,null,0,"項目_エミ_伝導妨害波",3]
[4,"イミュニティ",1,0,0,null,1,"項目_イミ",4]
[5,"静電気",2,0,0,null,0,"項目_イミ_静電気",5]
[6,"放射電磁界",2,0,0,null,0,"項目_イミ_放射電磁界",6]
{"$rows_left_out":46}
{"sheet":"設定_試験区分","index":16,"n_rows":192,"n_cols":11,"rows_kept":192,"hidden":true}
[]
[]
[]
["項番","タイトル","階層","表示非表示","表示タイプ","測定周波数範囲","親試験区分フラグ","試験区分コード","表示順","備考","検査用VLOOKUP用"]
[1,"5．試験区分－電磁両立性 エミッション",1,0,0,null,1,"エミ"]
[2,"5.1．放射妨害波 （エンクロージャーポート）",2,0,0,null,0,"エミ_放射_エンク"]
[3,"放射妨害波電界強度試験",3,0,0,null,0,"エミ_放射_エンク_妨害電界"]
[4,"基準大地面上（付属書：VF102またはVF103）",4,0,0,null,0,"エミ_放射_エンク_妨害電界_基準"]
[5,"FCC, CISPR11関連の1GHz超試験も含む",5,0,1,null,0]
[6,"測定周波数範囲：30MHz～",5,0,4,"@[O-3]@GHz",0,"エミ_放射_エンク_妨害電界_基準_測定周波数範囲"]
{"$rows_left_out":183}
{"sheet":"設定_試験規格","index":17,"n_rows":410,"n_cols":12,"rows_kept":410,"hidden":true}
[]
[]
[]
["項番","タイトル","階層","表示非表示","表示タイプ","枝番入力","親試験規格フラグ","試験規格コード","表示順","備考","検査用VLOOKUP用","検査用VLOOKUP用"]
[1,"14．試験規格－電磁両立性エミッション",1,0,0,null,1,"エミッション",null,null,{"$f":"VLOOKUP(H5,試験規格マスタ!A:H,2,FALSE)","v":"エミッション試験"},{"$f":"VLOOKUP(B5,試験規格マスタ!H:H,1,FALSE)","v":"14．試験規格－電磁両立性エミッション"}]
[2,"VCCI技術基準 V-3",2,0,0,null,0,"エミッション_VCCI技術基準V-3",null,null,{"$f":"VLOOKUP(H6,試験規格マスタ!A:H,2,FALSE)","v":"VCCI技術基準V-3"},{"$f":"VLOOKUP(B6,試験規格マスタ!H:H,1,FALSE)","v":"VCCI技術基準 V-3"}]
[3,"FCC Part15B　この項にチェックする場合は、申請書の【英文名称入力】シートを入力して下さい。",2,0,0,null,0,"エミッション_FCC_Part15B",null,null,{"$f":"VLOOKUP(H7,試験規格マスタ!A:H,2,FALSE)","v":"FCC Part15B"},{"$f":"VLOOKUP(B7,試験規格マスタ!H:H,1,FALSE)","v":"FCC Part15B　この項にチェックする場合は、申請書の【英文名称入力】シートを入力して下さい。"}]
[4,"Subpart B ITE等、非意図放射機器試験",3,0,0,null,0,"エミッション_FCC_Part15B_SubB_情報処理装置等",null,null,{"$f":"VLOOKUP(H8,試験規格マスタ!A:H,2,FALSE)","v":"Subpart B 情報処理装置等、非意図放射機器試験"},{"$f":"VLOOKUP(B8,試験規格マスタ!H:H,1,FALSE)","v":"Subpart B ITE等、非意図放射機器試験"}]
[5,"ANSI C63.4:2003",4,0,0,null,0,"エミッション_FCC_Part15B_SubB_情報処理装置等_ANSI_63_4_2003",null,null,{"$f":"VLOOKUP(H9,試験規格マスタ!A:H,2,FALSE)","v":"ANSI C63.4:2003"},{"$f":"VLOOKUP(B9,試験規格マスタ!H:H,1,FALSE)","v":{"$error":"#N/A"}}]
[6,"ANSI C63.4:2009",4,0,0,null,0,"エミッション_FCC_Part15B_SubB_情報処理装置等_ANSI_63_4_2009",null,null,{"$f":"VLOOKUP(H10,試験規格マスタ!A:H,2,FALSE)","v":"ANSI C63.4:2009"},{"$f":"VLOOKUP(B10,試験規格マスタ!H:H,1,FALSE)","v":{"$error":"#N/A"}}]
{"$rows_left_out":401}
{"sheet":"事務局用メニュー","index":18,"n_rows":2,"n_cols":2,"rows_kept":2,"hidden":true}
[]
[null,"事務局用メニュー"]

{"sheet":"【テンプレート】新規格入力","index":19,"n_rows":33,"n_cols":26,"rows_kept":33,"hidden":true,"merged":[[3,1,3,11],[3,12,3,13],[3,14,3,24],[3,25,3,26],[4,1,4,11],[4,12,4,13],[4,14,4,24],[4,25,4,26],[5,1,5,11],[5,12,5,13],[5,14,5,24],[5,25,5,26],[6,1,6,11],[6,12,6,13],[6,14,6,24],[6,25,6,26],[7,1,7,11],[7,12,7,13],[7,14,7,24],[7,25,7,26],[8,1,8,11],[8,12,8,13],[8,14,8,24],[8,25,8,26],[9,1,9,11],[9,12,9,13],[9,14,9,24],[9,25,9,26],[10,1,10,11],[10,12,10,13],[10,14,10,24],[10,25,10,26],[11,1,11,11],[11,12,11,13],[11,14,11,24],[11,25,11,26],[12,1,12,11],[12,12,12,13],[12,14,12,24],[12,25,12,26],[13,1,13,11],[13,12,13,13],[13,14,13,24],[13,25,13,26],[21,1,21,11],[21,12,21,13],[21,14,21,24],[21,25,21,26],[22,1,22,11],[22,12,22,13],[22,14,22,24],[22,25,22,26],[23,1,23,11],[23,12,23,13],[23,14,23,24],[23,25,23,26],[24,1,24,11],[24,12,24,13],[24,14,24,24],[24,25,24,26],[25,1,25,11],[25,12,25,13],[25,14,25,24],[25,25,25,26],[26,1,26,11],[26,12,26,13],[26,14,26,24],[26,25,26,26],[27,1,27,11],[27,12,27,13],[27,14,27,24],[27,25,27,26],[28,1,28,11],[28,12,28,13],[28,14,28,24],[28,25,28,26],[29,1,29,11],[29,12,29,13],[29,14,29,24],[29,25,29,26],[30,1,30,11],[30,12,30,13],[30,14,30,24],[30,25,30,26],[31,1,31,11],[31,12,31,13],[31,14,31,24],[31,25,31,26]]}
[]
[null,"記載のない試験規格をご希望の場合はここにご記入ください"]
[null,"注：下記に記載の規格番号及び表記が認定証に記載されます"]
[null,"日本語規格番号",{"$nulls":10},"通則版",null,"英語規格番号",{"$nulls":10},"通則版"]
{"$rows_empty":10}
[null,"行追加"]
[]
[]
[]
[]
{"$rows_left_out":5}